{"text_format":"1","workbook":"xlsx","n_sheets":17,"sheets":["RFPR cover","Data","Content & Version Control","Change log","R1 - RoRE","R2 - Revenue","R3 - Rec to totex","R4 - Totex","R5 - Output Incentives","R6 - Innovation","R7 - Financing","R8 - Net Debt","R9 - RAV","R10 - Tax","R11 - Dividends","R12 - Pensions","R13 - Other Activities"],"not_rendered":{"charts":0,"images":1,"macros":0,"external_links":6,"defined_names":358,"comments":0,"pivot_tables":0},"unopened":[],"bounds":{"document_bytes":16777216,"sheet_cells":100000,"rows_first":2000,"rows_last":500,"rows_between":2000,"halvings":0,"cell_chars":16384,"cell_head_chars":4096},"cells_cut":0,"cells_raw":0,"read":"whole","date_system":"1900"}

{"sheet":"RFPR cover","index":0,"n_rows":14,"n_cols":7,"rows_kept":14,"cut":false,"hidden":false,"merged":[]}
["Regulatory Financial Performance Report"]
[{"$f":"'RFPR cover'!C5","v":"Cadent-London"}]
[{"$f":"'RFPR cover'!C7","v":2020}]
[]
[null,"Licensee","Cadent-London",null,null,null,"Input cells"]
[null,"Sector",{"$f":"INDEX(Data!$A$73:$A$100,MATCH($C$5,Data!$B$73:$B$100,0),0)&\"1\"","v":"GD1"},null,null,null,"Totals cells (of formula within worksheet)"]
[null,"Reporting Year:\n(enter 2014 for 2013-14)",2020,null,null,null,"Referencing to other worksheets"]
[null,"Version (Number)",null,null,null,null,"Referencing to other workbooks"]
[null,"Submitted Date:",null,null,null,null,"Check cells"]
[null,"Cost of Equity",{"$f":"SUMIF(Data!$B$72:$B$100,C5,Data!$C$72:$C$100)","v":6.7000000000000004E-2},null,null,null,"No Input"]
[null,"Sharing Factor",{"$f":"SUMIF(Data!$B$72:$B$100,C5,Data!$D$72:$D$100)","v":0.63039999999999996},null,null,null,"Descriptions and pack data"]
[null,"Notional Gearing",{"$f":"SUMIF(Data!$B$72:$B$100,C5,Data!$E$72:$E$100)","v":0.65}]
[null,"RIIO-1 start date",{"$f":"INDEX(Data!$G$73:$G$100,MATCH($C$5,Data!$B$73:$B$100,0),0)","v":2014},null,null,"Materiality £m"]
[null,"Price basis",{"$f":"INDEX(Data!$H$73:$H$100,MATCH($C$5,Data!$B$73:$B$100,0),0)","v":"£m 09/10"},null,null,0.1]

{"sheet":"Data","index":1,"n_rows":267,"n_cols":20,"rows_kept":267,"cut":false,"hidden":false,"merged":[[37,10,37,12],[38,10,38,12],[53,6,53,8],[53,9,53,10],[54,6,54,8],[54,9,54,10],[167,1,167,2],[55,6,55,8],[55,9,55,10],[56,6,56,8],[56,9,56,10],[70,10,70,19],[161,1,161,2],[162,1,162,2],[163,1,163,2],[164,1,164,2],[165,1,165,2],[166,1,166,2],[182,1,182,2],[182,4,182,8],[168,1,168,2],[171,1,171,2],[172,1,172,2],[173,1,173,2],[174,1,174,2],[175,1,175,2],[176,1,176,2],[177,1,177,2],[178,1,178,2],[181,1,181,2],[181,4,181,8],[183,1,183,2],[183,4,183,8],[184,1,184,2],[184,4,184,8],[185,1,185,2],[185,4,185,8],[186,1,186,2],[186,4,186,8],[187,1,187,2],[187,4,187,8],[188,1,188,2],[188,4,188,8],[191,1,191,2],[191,4,191,8],[192,1,192,2],[192,4,192,8],[193,1,193,2],[193,4,193,8],[194,1,194,2],[194,4,194,8],[195,1,195,2],[195,4,195,8],[196,1,196,2],[196,4,196,8],[197,1,197,2],[197,4,197,8],[198,1,198,2],[198,4,198,8],[201,1,201,2],[201,4,201,8],[202,1,202,2],[202,4,202,8],[203,1,203,2],[203,4,203,8],[204,1,204,2],[204,4,204,8],[208,1,208,2],[208,4,208,8],[211,1,211,3],[205,1,205,2],[205,4,205,8],[206,1,206,2],[206,4,206,8],[207,1,207,2],[207,4,207,8]]}
["Network Operator Data"]
[{"$f":"'RFPR cover'!C5","v":"Cadent-London"}]
[{"$f":"'RFPR cover'!C7","v":2020}]
[]
[]
[null,2018,"2017-18"]
[null,2019,"2018-19"]
[null,2020,"2019-20"]
[null,2021,"2020-21"]
[null,2022,"2021-22"]
[null,2023,"2022-23"]
[]
[null,"RPI Index","Reporting year","Actual / Forecast index","Financial Year Average RPI\n(RPIt)","Year end RPI","Corp. Tax"]
[null,"2009-10",2010,{"$f":"IF(VALUE(C14)<='RFPR cover'!$C$7,\"Actual\",\"Forecast\")","v":"Actual"},215.767,221.75,0.28000000000000003]
[null,"2010-11",2011,{"$f":"IF(VALUE(C15)<='RFPR cover'!$C$7,\"Actual\",\"Forecast\")","v":"Actual"},226.47499999999999,233.45,0.28000000000000003]
[null,"2011-12",2012,{"$f":"IF(VALUE(C16)<='RFPR cover'!$C$7,\"Actual\",\"Forecast\")","v":"Actual"},237.34200000000001,241.65,0.26]
[null,"2012-13",2013,{"$f":"IF(VALUE(C17)<='RFPR cover'!$C$7,\"Actual\",\"Forecast\")","v":"Actual"},244.67500000000001,249.1,0.24]
[null,"2013-14",2014,{"$f":"IF(VALUE(C18)<='RFPR cover'!$C$7,\"Actual\",\"Forecast\")","v":"Actual"},251.733,255.25,0.23]
[null,"2014-15",2015,{"$f":"IF(VALUE(C19)<='RFPR cover'!$C$7,\"Actual\",\"Forecast\")","v":"Actual"},256.66699999999997,257.55,0.21]
[null,"2015-16",2016,{"$f":"IF(VALUE(C20)<='RFPR cover'!$C$7,\"Actual\",\"Forecast\")","v":"Actual"},259.43299999999999,261.25,0.2]
[null,"2016-17",2017,{"$f":"IF(VALUE(C21)<='RFPR cover'!$C$7,\"Actual\",\"Forecast\")","v":"Actual"},264.99200000000002,269.95000000000005,0.2]
[null,"2017-18",2018,{"$f":"IF(VALUE(C22)<='RFPR cover'!$C$7,\"Actual\",\"Forecast\")","v":"Actual"},274.90800000000002,279,0.19]
[null,"2018-19",2019,{"$f":"IF(VALUE(C23)<='RFPR cover'!$C$7,\"Actual\",\"Forecast\")","v":"Actual"},283.30799999999999,286.64999999999998,0.19]
[null,"2019-20",2020,{"$f":"IF(VALUE(C24)<='RFPR cover'!$C$7,\"Actual\",\"Forecast\")","v":"Actual"},290.642,292.60000000000002,0.19]
[null,"2020-21",2021,{"$f":"IF(VALUE(C25)<='RFPR cover'!$C$7,\"Actual\",\"Forecast\")","v":"Forecast"},{"$f":"E24*(1+INDEX($D$43:$J$43,0,MATCH($C25,$D$42:$J$42,0)))","v":297.32676599999996},299.32979999999998,0.19]
[null,"2021-22",2022,{"$f":"IF(VALUE(C26)<='RFPR cover'!$C$7,\"Actual\",\"Forecast\")","v":"Forecast"},303.64495977749993,305.69055824999998,0.19]
[null,"2022-23",2023,{"$f":"IF(VALUE(C27)<='RFPR cover'!$C$7,\"Actual\",\"Forecast\")","v":"Forecast"},311.46381749177056,313.56209012493747,0.19]
[null,"2023-24",2024,{"$f":"IF(VALUE(C28)<='RFPR cover'!$C$7,\"Actual\",\"Forecast\")","v":"Forecast"},null,null,0.19]
[null,"2024-25",2025,{"$f":"IF(VALUE(C29)<='RFPR cover'!$C$7,\"Actual\",\"Forecast\")","v":"Forecast"},null,null,0.19]
[null,"2025-26",2026,{"$f":"IF(VALUE(C30)<='RFPR cover'!$C$7,\"Actual\",\"Forecast\")","v":"Forecast"},null,null,0.19]
[]
[null,null,{"$f":"IF(C33<='RFPR cover'!$C$7,\"Actuals\",\"Forecast\")","v":"Actuals"},{"$f":"IF(D33<='RFPR cover'!$C$7,\"Actuals\",\"Forecast\")","v":"Actuals"},{"$f":"IF(E33<='RFPR cover'!$C$7,\"Actuals\",\"Forecast\")","v":"Actuals"},{"$f":"IF(F33<='RFPR cover'!$C$7,\"Actuals\",\"Forecast\")","v":"Actuals"},{"$f":"IF(G33<='RFPR cover'!$C$7,\"Actuals\",\"Forecast\")","v":"Actuals"},{"$f":"IF(H33<='RFPR cover'!$C$7,\"Actuals\",\"Forecast\")","v":"Actuals"},{"$f":"IF(I33<='RFPR cover'!$C$7,\"Actuals\",\"Forecast\")","v":"Actuals"},{"$f":"IF(J33<='RFPR cover'!$C$7,\"Actuals\",\"Forecast\")","v":"Forecast"}]
[null,null,{"$f":"'RFPR cover'!$C$13","v":2014},{"$f":"C33+1","v":2015},2016,2017,2018,2019,2020,2021]
[null,"Financial Year Average RPI (RPIt)",{"$f":"INDEX(Data!$E$14:$E$30,MATCH(C$33,Data!$C$14:$C$30,0),0)/IF('RFPR cover'!$C$6=\"ED1\",Data!$E$17,Data!$E$14)","v":1.1666890673736021},{"$f":"INDEX(Data!$E$14:$E$30,MATCH(D$33,Data!$C$14:$C$30,0),0)/IF('RFPR cover'!$C$6=\"ED1\",Data!$E$17,Data!$E$14)","v":1.1895563269638081},{"$f":"INDEX(Data!$E$14:$E$30,MATCH(E$33,Data!$C$14:$C$30,0),0)/IF('RFPR cover'!$C$6=\"ED1\",Data!$E$17,Data!$E$14)","v":1.2023757108362261},{"$f":"INDEX(Data!$E$14:$E$30,MATCH(F$33,Data!$C$14:$C$30,0),0)/IF('RFPR cover'!$C$6=\"ED1\",Data!$E$17,Data!$E$14)","v":1.2281396135646323},{"$f":"INDEX(Data!$E$14:$E$30,MATCH(G$33,Data!$C$14:$C$30,0),0)/IF('RFPR cover'!$C$6=\"ED1\",Data!$E$17,Data!$E$14)","v":1.2740965949380583},{"$f":"INDEX(Data!$E$14:$E$30,MATCH(H$33,Data!$C$14:$C$30,0),0)/IF('RFPR cover'!$C$6=\"ED1\",Data!$E$17,Data!$E$14)","v":1.3130274787154661},{"$f":"INDEX(Data!$E$14:$E$30,MATCH(I$33,Data!$C$14:$C$30,0),0)/IF('RFPR cover'!$C$6=\"ED1\",Data!$E$17,Data!$E$14)","v":1.3470178479563604},{"$f":"INDEX(Data!$E$14:$E$30,MATCH(J$33,Data!$C$14:$C$30,0),0)/IF('RFPR cover'!$C$6=\"ED1\",Data!$E$17,Data!$E$14)","v":1.3779992584593566}]
[null,"Year end RPI",{"$f":"INDEX(Data!$F$14:$F$30,MATCH(C$33,Data!$C$14:$C$30,0),0)/IF('RFPR cover'!$C$6=\"ED1\",Data!$E$17,Data!$E$14)","v":1.1829890576408812},{"$f":"INDEX(Data!$F$14:$F$30,MATCH(D$33,Data!$C$14:$C$30,0),0)/IF('RFPR cover'!$C$6=\"ED1\",Data!$E$17,Data!$E$14)","v":1.1936487043894572},{"$f":"INDEX(Data!$F$14:$F$30,MATCH(E$33,Data!$C$14:$C$30,0),0)/IF('RFPR cover'!$C$6=\"ED1\",Data!$E$17,Data!$E$14)","v":1.2107968317676012},{"$f":"INDEX(Data!$F$14:$F$30,MATCH(F$33,Data!$C$14:$C$30,0),0)/IF('RFPR cover'!$C$6=\"ED1\",Data!$E$17,Data!$E$14)","v":1.2511181042513455},{"$f":"INDEX(Data!$F$14:$F$30,MATCH(G$33,Data!$C$14:$C$30,0),0)/IF('RFPR cover'!$C$6=\"ED1\",Data!$E$17,Data!$E$14)","v":1.2930614968924812},{"$f":"INDEX(Data!$F$14:$F$30,MATCH(H$33,Data!$C$14:$C$30,0),0)/IF('RFPR cover'!$C$6=\"ED1\",Data!$E$17,Data!$E$14)","v":1.3285164089040491},{"$f":"INDEX(Data!$F$14:$F$30,MATCH(I$33,Data!$C$14:$C$30,0),0)/IF('RFPR cover'!$C$6=\"ED1\",Data!$E$17,Data!$E$14)","v":1.3560924515797135},{"$f":"INDEX(Data!$F$14:$F$30,MATCH(J$33,Data!$C$14:$C$30,0),0)/IF('RFPR cover'!$C$6=\"ED1\",Data!$E$17,Data!$E$14)","v":1.3872825779660467}]
[null,"1 year change in Fin Year Ave RPI",{"$f":"INDEX(Data!$E$14:$E$30,MATCH(C$33,Data!$C$14:$C$30,0))/INDEX(Data!$E$14:$E$30,MATCH(C$33-1,Data!$C$14:$C$30,0))","v":1.0288464289363441},{"$f":"INDEX(Data!$E$14:$E$30,MATCH(D$33,Data!$C$14:$C$30,0))/INDEX(Data!$E$14:$E$30,MATCH(D$33-1,Data!$C$14:$C$30,0))","v":1.0196001318857677},{"$f":"INDEX(Data!$E$14:$E$30,MATCH(E$33,Data!$C$14:$C$30,0))/INDEX(Data!$E$14:$E$30,MATCH(E$33-1,Data!$C$14:$C$30,0))","v":1.0107766093810269},{"$f":"INDEX(Data!$E$14:$E$30,MATCH(F$33,Data!$C$14:$C$30,0))/INDEX(Data!$E$14:$E$30,MATCH(F$33-1,Data!$C$14:$C$30,0))","v":1.0214274976583551},{"$f":"INDEX(Data!$E$14:$E$30,MATCH(G$33,Data!$C$14:$C$30,0))/INDEX(Data!$E$14:$E$30,MATCH(G$33-1,Data!$C$14:$C$30,0))","v":1.0374199975848328},{"$f":"INDEX(Data!$E$14:$E$30,MATCH(H$33,Data!$C$14:$C$30,0))/INDEX(Data!$E$14:$E$30,MATCH(H$33-1,Data!$C$14:$C$30,0))","v":1.0305556768082411},{"$f":"INDEX(Data!$E$14:$E$30,MATCH(I$33,Data!$C$14:$C$30,0))/INDEX(Data!$E$14:$E$30,MATCH(I$33-1,Data!$C$14:$C$30,0))","v":1.0258870204865376},{"$f":"INDEX(Data!$E$14:$E$30,MATCH(J$33,Data!$C$14:$C$30,0))/INDEX(Data!$E$14:$E$30,MATCH(J$33-1,Data!$C$14:$C$30,0))","v":1.0229999999999999}]
[null,"HMT Forecasts for UK Economy - M3 New Forecasts RPI"]
[null,null,"Calendar Year",2017,{"$f":"D38+1","v":2018},2019,2020,2021,2022,2023,"Source"]
[null,"M3 New Forecasts RPI",null,null,null,2.5999999999999999E-2,2.4E-2,0.02,2.5000000000000001E-2,2.8000000000000001E-2,"December 2019 Publication"]
[]
[null,"Forecast growth rate"]
[null,null,"Reporting Year",2017,{"$f":"D42+1","v":2018},2019,2020,2021,2022,2023]
[null,"Future inflation assumption",null,null,null,null,{"$f":"(F39*0.75)+(G39*0.25)","v":2.5500000000000002E-2},{"$f":"(G39*0.75)+(H39*0.25)","v":2.3000000000000003E-2},{"$f":"(H39*0.75)+(I39*0.25)","v":2.1249999999999998E-2},{"$f":"(I39*0.75)+(J39*0.25)","v":2.5750000000000002E-2}]
[]
[null,{"$f":"\"Selected Capitalisation rates for \"&'RFPR cover'!C5","v":"Selected Capitalisation rates for Cadent-London"}]
[]
[null,null,"RIIO1"]
[null,{"$f":"INDEX($G$54:$G$57,MATCH(LEFT('RFPR cover'!$C$6,2),Data!$E$54:$E$57,0),0)","v":"Totex excluding repex"},{"$f":"INDEX($F$73:$F$100,MATCH('RFPR cover'!$C$5,Data!$B$73:$B$100,0),0)","v":0.23469337831705597}]
[]
[null,null,2014,{"$f":"C50+1","v":2015},2016,2017,2018,2019,2020,2021]
[null,{"$f":"INDEX($J$54:$J$57,MATCH(LEFT('RFPR cover'!$C$6,2),Data!$E$54:$E$57,0),0)","v":"Repex"},{"$f":"IFERROR(INDEX(C$106:C$115,MATCH('RFPR cover'!$C$5,Data!$B$106:$B$115,0),0),0)","v":0.5},{"$f":"IFERROR(INDEX(D$106:D$115,MATCH('RFPR cover'!$C$5,Data!$B$106:$B$115,0),0),0)","v":0.5714285714285714},{"$f":"IFERROR(INDEX(E$106:E$115,MATCH('RFPR cover'!$C$5,Data!$B$106:$B$115,0),0),0)","v":0.64285714285714279},{"$f":"IFERROR(INDEX(F$106:F$115,MATCH('RFPR cover'!$C$5,Data!$B$106:$B$115,0),0),0)","v":0.71428571428571419},{"$f":"IFERROR(INDEX(G$106:G$115,MATCH('RFPR cover'!$C$5,Data!$B$106:$B$115,0),0),0)","v":0.78571428571428559},{"$f":"IFERROR(INDEX(H$106:H$115,MATCH('RFPR cover'!$C$5,Data!$B$106:$B$115,0),0),0)","v":0.85714285714285698},{"$f":"IFERROR(INDEX(I$106:I$115,MATCH('RFPR cover'!$C$5,Data!$B$106:$B$115,0),0),0)","v":0.92857142857142838},{"$f":"IFERROR(INDEX(J$106:J$115,MATCH('RFPR cover'!$C$5,Data!$B$106:$B$115,0),0),0)","v":1}]
[]
[]
[null,null,null,null,"ED","£m 12/13","Totex",null,null,"n/a"]
[null,null,null,null,"ET","£m 09/10","Totex",null,null,"n/a"]
[null,null,null,null,"GD","£m 09/10","Totex excluding repex",null,null,"Repex"]
[null,null,null,null,"GT","£m 09/10","Totex (non-'uncertainty rate')",null,null,"Uncertainty rate"]
[]
[]
[]
[null,"Allowed cost of debt %"]
[null,null,2014,{"$f":"C62+1","v":2015},2016,2017,2018,2019,2020,2021,2022,2023]
[null,"WPD",null,null,2.5499999999999998E-2,2.3799999999999998E-2,2.2200000000000001E-2,1.9099999999999999E-2,1.5800000000000002E-2,1.09E-2,7.7000000000000002E-3,4.5999999999999999E-3]
[null,"ED - excluding WPD",null,null,2.5499999999999998E-2,2.4199999999999999E-2,2.29E-2,2.0899999999999998E-2,1.9400000000000001E-2,1.78E-2,1.6299999999999999E-2,1.4800000000000001E-2]
[null,"SHET",2.92E-2,2.5000000000000001E-2,2.1499999999999998E-2,1.7899999999999999E-2,1.5100000000000001E-2,1.1599999999999999E-2,1.0200000000000001E-2,8.3000000000000001E-3]
[null,"ET - excluding SHET",2.92E-2,2.7199999999999998E-2,2.5499999999999998E-2,2.3800000000000002E-2,2.2200000000000001E-2,1.9099999999999999E-2,1.5800000000000002E-2,1.09E-2]
[null,"GD",2.92E-2,2.7199999999999998E-2,2.5499999999999998E-2,2.3800000000000002E-2,2.2200000000000001E-2,1.9099999999999999E-2,1.5800000000000002E-2,1.09E-2]
[null,"GT",2.92E-2,2.7199999999999998E-2,2.5499999999999998E-2,2.3800000000000002E-2,2.2200000000000001E-2,1.9099999999999999E-2,1.5800000000000002E-2,1.09E-2]
[]
[]
[null,null,"Allowed \nCost of Equity","TIM Incentive Strength","Gearing","Main Cap. Rate","RIIO1 start date","Price Basis","Fast Tracked","IQI pre or post tax","Allowed cost of debt"]
["Sector","Default",null,null,null,null,null,null,null,null,2014,{"$f":"K72+1","v":2015},2016,2017,2018,2019,2020,2021,2022,2023]
["ED","ENWL",0.06,0.58109999999999995,0.65,0.68,2016,{"$f":"VLOOKUP($A73,$E$54:$F$57,2,FALSE)","v":"£m 12/13"},"No","Post",null,null,{"$f":"E$64","v":2.5499999999999998E-2},2.4199999999999999E-2,2.29E-2,2.0899999999999998E-2,1.9400000000000001E-2,1.78E-2,1.6299999999999999E-2,1.4800000000000001E-2]
["ED","NPgN",0.06,0.55843703457782867,0.65,0.7,2016,"£m 12/13","No","Post",null,null,2.5499999999999998E-2,2.4199999999999999E-2,2.29E-2,2.0899999999999998E-2,1.9400000000000001E-2,1.78E-2,1.6299999999999999E-2,1.4800000000000001E-2]
["ED","NPgY",0.06,0.55843703457782867,0.65,0.72,2016,"£m 12/13","No","Post",null,null,2.5499999999999998E-2,2.4199999999999999E-2,2.29E-2,2.0899999999999998E-2,1.9400000000000001E-2,1.78E-2,1.6299999999999999E-2,1.4800000000000001E-2]
["ED","UKPN-EPN",0.06,0.53280000000000005,0.65,0.68,2016,"£m 12/13","No","Post",null,null,2.5499999999999998E-2,2.4199999999999999E-2,2.29E-2,2.0899999999999998E-2,1.9400000000000001E-2,1.78E-2,1.6299999999999999E-2,1.4800000000000001E-2]
["ED","UKPN-LPN",0.06,0.53280000000000005,0.65,0.68,2016,"£m 12/13","No","Post",null,null,2.5499999999999998E-2,2.4199999999999999E-2,2.29E-2,2.0899999999999998E-2,1.9400000000000001E-2,1.78E-2,1.6299999999999999E-2,1.4800000000000001E-2]
["ED","UKPN-SPN",0.06,0.53280000000000005,0.65,0.68,2016,"£m 12/13","No","Post",null,null,2.5499999999999998E-2,2.4199999999999999E-2,2.29E-2,2.0899999999999998E-2,1.9400000000000001E-2,1.78E-2,1.6299999999999999E-2,1.4800000000000001E-2]
["ED","SPD",0.06,0.53500000000000003,0.65,0.8,2016,"£m 12/13","No","Post",null,null,2.5499999999999998E-2,2.4199999999999999E-2,2.29E-2,2.0899999999999998E-2,1.9400000000000001E-2,1.78E-2,1.6299999999999999E-2,1.4800000000000001E-2]
["ED","SPMW",0.06,0.53500000000000003,0.65,0.8,2016,"£m 12/13","No","Post",null,null,2.5499999999999998E-2,2.4199999999999999E-2,2.29E-2,2.0899999999999998E-2,1.9400000000000001E-2,1.78E-2,1.6299999999999999E-2,1.4800000000000001E-2]
["ED","SSEH",0.06,0.56469999999999998,0.65,0.62,2016,"£m 12/13","No","Post",null,null,2.5499999999999998E-2,2.4199999999999999E-2,2.29E-2,2.0899999999999998E-2,1.9400000000000001E-2,1.78E-2,1.6299999999999999E-2,1.4800000000000001E-2]
["ED","SSES",0.06,0.56469999999999998,0.65,0.7,2016,"£m 12/13","No","Post",null,null,2.5499999999999998E-2,2.4199999999999999E-2,2.29E-2,2.0899999999999998E-2,1.9400000000000001E-2,1.78E-2,1.6299999999999999E-2,1.4800000000000001E-2]
["ED","WPD-EMID",6.4000000000000001E-2,0.7,0.65,0.8,2016,"£m 12/13","Yes","Pre",null,null,{"$f":"E$63","v":2.5499999999999998E-2},2.3799999999999998E-2,2.2200000000000001E-2,1.9099999999999999E-2,1.5800000000000002E-2,1.09E-2,7.7000000000000002E-3,4.5999999999999999E-3]
["ED","WPD-WMID",6.4000000000000001E-2,0.7,0.65,0.8,2016,"£m 12/13","Yes","Pre",null,null,2.5499999999999998E-2,2.3799999999999998E-2,2.2200000000000001E-2,1.9099999999999999E-2,1.5800000000000002E-2,1.09E-2,7.7000000000000002E-3,4.5999999999999999E-3]
["ED","WPD-SWALES",6.4000000000000001E-2,0.7,0.65,0.8,2016,"£m 12/13","Yes","Pre",null,null,2.5499999999999998E-2,2.3799999999999998E-2,2.2200000000000001E-2,1.9099999999999999E-2,1.5800000000000002E-2,1.09E-2,7.7000000000000002E-3,4.5999999999999999E-3]
["ED","WPD-SWEST",6.4000000000000001E-2,0.7,0.65,0.8,2016,"£m 12/13","Yes","Pre",null,null,2.5499999999999998E-2,2.3799999999999998E-2,2.2200000000000001E-2,1.9099999999999999E-2,1.5800000000000002E-2,1.09E-2,7.7000000000000002E-3,4.5999999999999999E-3]
["GD","Cadent-EOE",6.7000000000000004E-2,0.63039999999999996,0.65,0.26634501855794862,2014,"£m 09/10","No","Pre",{"$f":"C$67","v":2.92E-2},2.7199999999999998E-2,2.5499999999999998E-2,2.3800000000000002E-2,2.2200000000000001E-2,1.9099999999999999E-2,1.5800000000000002E-2,1.09E-2]
["GD","Cadent-London",6.7000000000000004E-2,0.63039999999999996,0.65,0.23469337831705597,2014,"£m 09/10","No","Pre",2.92E-2,2.7199999999999998E-2,2.5499999999999998E-2,2.3800000000000002E-2,2.2200000000000001E-2,1.9099999999999999E-2,1.5800000000000002E-2,1.09E-2]
["GD","Cadent-WM",6.7000000000000004E-2,0.63039999999999996,0.65,0.24946223864843597,2014,"£m 09/10","No","Pre",2.92E-2,2.7199999999999998E-2,2.5499999999999998E-2,2.3800000000000002E-2,2.2200000000000001E-2,1.9099999999999999E-2,1.5800000000000002E-2,1.09E-2]
["GD","Cadent-NW",6.7000000000000004E-2,0.63039999999999996,0.65,0.26095352485819256,2014,"£m 09/10","No","Pre",2.92E-2,2.7199999999999998E-2,2.5499999999999998E-2,2.3800000000000002E-2,2.2200000000000001E-2,1.9099999999999999E-2,1.5800000000000002E-2,1.09E-2]
["GD","NGN",6.7000000000000004E-2,0.63980000000000004,0.65,0.34984411379298247,2014,"£m 09/10","No","Pre",2.92E-2,2.7199999999999998E-2,2.5499999999999998E-2,2.3800000000000002E-2,2.2200000000000001E-2,1.9099999999999999E-2,1.5800000000000002E-2,1.09E-2]
["GD","SGN - Scotland",6.7000000000000004E-2,0.63729999999999998,0.65,0.35129049661183626,2014,"£m 09/10","No","Pre",2.92E-2,2.7199999999999998E-2,2.5499999999999998E-2,2.3800000000000002E-2,2.2200000000000001E-2,1.9099999999999999E-2,1.5800000000000002E-2,1.09E-2]
["GD","SGN - Southern",6.7000000000000004E-2,0.63729999999999998,0.65,0.32230855902021693,2014,"£m 09/10","No","Pre",2.92E-2,2.7199999999999998E-2,2.5499999999999998E-2,2.3800000000000002E-2,2.2200000000000001E-2,1.9099999999999999E-2,1.5800000000000002E-2,1.09E-2]
["GD","WWU",6.7000000000000004E-2,0.63170000000000004,0.65,0.35781904469402892,2014,"£m 09/10","No","Pre",2.92E-2,2.7199999999999998E-2,2.5499999999999998E-2,2.3800000000000002E-2,2.2200000000000001E-2,1.9099999999999999E-2,1.5800000000000002E-2,1.09E-2]
["GT","NGGT (TO)",6.8000000000000005E-2,0.44359999999999999,0.625,0.64400000000000002,2014,"£m 09/10","No","Pre",{"$f":"C$68","v":2.92E-2},2.7199999999999998E-2,2.5499999999999998E-2,2.3800000000000002E-2,2.2200000000000001E-2,1.9099999999999999E-2,1.5800000000000002E-2,1.09E-2]
["GT","NGGT (SO)",6.8000000000000005E-2,0.44359999999999999,0.625,0.374,2014,"£m 09/10","No","Pre",2.92E-2,2.7199999999999998E-2,2.5499999999999998E-2,2.3800000000000002E-2,2.2200000000000001E-2,1.9099999999999999E-2,1.5800000000000002E-2,1.09E-2]
["ET","NGET (TO)",7.0000000000000007E-2,0.46889999999999998,0.6,0.85,2014,"£m 09/10","No","Pre",{"$f":"C$66","v":2.92E-2},2.7199999999999998E-2,2.5499999999999998E-2,2.3800000000000002E-2,2.2200000000000001E-2,1.9099999999999999E-2,1.5800000000000002E-2,1.09E-2]
["ET","NGET (SO)",7.0000000000000007E-2,0.46889999999999998,0.6,0.27900000000000003,2014,"£m 09/10","No","Pre",2.92E-2,2.7199999999999998E-2,2.5499999999999998E-2,2.3800000000000002E-2,2.2200000000000001E-2,1.9099999999999999E-2,1.5800000000000002E-2,1.09E-2]
["ET","SPT",7.0000000000000007E-2,0.5,0.55000000000000004,0.9,2014,"£m 09/10","Yes","Pre",2.92E-2,2.7199999999999998E-2,2.5499999999999998E-2,2.3800000000000002E-2,2.2200000000000001E-2,1.9099999999999999E-2,1.5800000000000002E-2,1.09E-2]
["ET","SHET",7.0000000000000007E-2,0.5,0.55000000000000004,0.9,2014,"£m 09/10","Yes","Pre",{"$f":"C$65","v":2.92E-2},2.5000000000000001E-2,2.1499999999999998E-2,1.7899999999999999E-2,1.5100000000000001E-2,1.1599999999999999E-2,1.0200000000000001E-2,8.3000000000000001E-3]
[]
[]
[]
[null,"GD: Capitalised share of repex / GT: Uncertainty Rate"]
[null,null,2014,{"$f":"C105+1","v":2015},2016,2017,2018,2019,2020,2021]
[null,"Cadent-EOE",0.5,0.5714285714285714,0.64285714285714279,0.71428571428571419,0.78571428571428559,0.85714285714285698,0.92857142857142838,1]
[null,"Cadent-London",0.5,0.5714285714285714,0.64285714285714279,0.71428571428571419,0.78571428571428559,0.85714285714285698,0.92857142857142838,1]
[null,"Cadent-WM",0.5,0.5714285714285714,0.64285714285714279,0.71428571428571419,0.78571428571428559,0.85714285714285698,0.92857142857142838,1]
[null,"Cadent-NW",0.5,0.5714285714285714,0.64285714285714279,0.71428571428571419,0.78571428571428559,0.85714285714285698,0.92857142857142838,1]
[null,"NGN",0.5,0.5714285714285714,0.64285714285714279,0.71428571428571419,0.78571428571428559,0.85714285714285698,0.92857142857142838,1]
[null,"SGN - Scotland",0.5,0.5714285714285714,0.64285714285714279,0.71428571428571419,0.78571428571428559,0.85714285714285698,0.92857142857142838,1]
[null,"SGN - Southern",0.5,0.5714285714285714,0.64285714285714279,0.71428571428571419,0.78571428571428559,0.85714285714285698,0.92857142857142838,1]
[null,"WWU",0.5,0.5714285714285714,0.64285714285714279,0.71428571428571419,0.78571428571428559,0.85714285714285698,0.92857142857142838,1]
[null,"NGGT (TO)",0.9,0.9,0.9,0.9,0.9,0.9,0.9,0.9]
[null,"NGGT (SO)"]
[]
[]
[null,"IQI Additional Income",2014,{"$f":"C118+1","v":2015},2016,2017,2018,2019,2020,2021,2022,2023]
[null,"ENWL",null,null,1.5575632164737283,1.4734141240658321,1.4689588897025405,1.4707200530126929,1.4674716260161711,1.4486206224386007,1.4956798325868756,1.4397148718051931]
[null,"NPgN",null,null,-0.65871781800535345,-0.63543772576063684,-0.58907862874233818,-0.58178188190178026,-0.56823918867341305,-0.51933170333654122,-0.47962665852661612,-0.4656874701170608]
[null,"NPgY",null,null,-0.86626036283610952,-0.81019773780890636,-0.78919084241395188,-0.79061873066036981,-0.74432653414361061,-0.70697274816976396,-0.65350946162011747,-0.66429758885743451]
[null,"UKPN-EPN",null,null,-3.2612134183503572,-3.3462554451402173,-3.1732919768141143,-3.1232404745251841,-3.0767551306224106,-2.9342177182087767,-2.8825938479182072,-2.7237011003750218]
[null,"UKPN-LPN",null,null,-2.4260972367898193,-2.3690383662844163,-2.2433276600060932,-2.1466020621213828,-2.174009678716605,-2.0538927838998693,-1.9044581231060691,-1.8008611131009082]
[null,"UKPN-SPN",null,null,-2.1861012409352765,-2.3820447425774849,-2.2418672366929897,-2.1147812646907029,-2.0146177086326591,-1.9421313262105093,-1.9248856430948595,-1.8464451304225615]
[null,"SPD",null,null,-1.8633532543800757,-1.8182980405067262,-1.83946756302578,-1.7415973428180247,-1.6798002111470465,-1.5974456358596774,-1.5016396120831343,-1.4453638876860204]
[null,"SPMW",null,null,-2.1317145269512103,-2.193973633026753,-1.9869010217130036,-1.8037552784318813,-1.7767942495618843,-1.7901472583807538,-1.6444113686346382,-1.467384504290556]
[null,"SSEH",null,null,0.16599721814464838,0.16631900606776751,0.16554337895881124,0.16569741136821181,0.16622630759870036,0.16380302414374548,0.16593344617950709,0.16036688822048883]
[null,"SSES",null,null,0.3648271976377423,0.37109083837102003,0.36071859106606846,0.35927814835295946,0.3227419487574148,0.32139075529498529,0.32876178406363676,0.31920430794598709]
[null,"WPD-EMID",null,null,7.1281196754416492,6.9674138399666772,6.2034025893135132,6.3085978915797085,6.2376648400128394,6.4865819943041139,6.8152516624832584,6.6271056201039169]
[null,"WPD-WMID",null,null,6.5079014730517413,6.5166167406950333,6.3292456496722922,6.4407397408462082,6.6367331985058957,6.7568163761394304,6.6961234445143969,6.7647427548792596]
[null,"WPD-SWALES",null,null,3.6763138465229663,3.6748350873956013,3.4998529635433906,3.724685546648324,3.4121739487309477,3.4202241027689042,3.3053549439575329,3.3633285641010966]
[null,"WPD-SWEST",null,null,5.3762701961708466,5.3775969760840585,5.2618102801807671,5.360849180672294,5.2665238228731912,5.3271179030285305,5.3223294006601192,5.5699880746272257]
[null,"Cadent-EOE",1.4371556068940596,1.3718015630879741,1.3507660107019517,1.356812198977974,1.3598136386487443,1.3501475065962032,1.3298433305384654,1.3174540960763355]
[null,"Cadent-London",1.2224510767557433,1.2198157429394254,1.2942164825881293,1.2596396269108345,1.2840112184368913,1.2678511857965422,1.2592019055105816,1.257376658609527]
[null,"Cadent-WM",0.82325002294811445,0.82663571281128501,0.79640504595610451,0.78757021450124798,0.81133252861207505,0.81064228783969072,0.80900368952296353,0.78043276967968189]
[null,"Cadent-NW",1.0893959849781105,1.027913194554035,1.0066987144123654,1.0192350900597893,1.0341480780318344,1.0204240792759967,1.0137739549704501,0.9898055017218621]
[null,"NGN",3.0675250143183739,3.1629219417602221,3.2156604222069194,3.1773534622131239,2.9925267771957293,2.9953978987575276,3.008780645638939,3.0035530345258876]
[null,"SGN - Scotland",2.1240897362733717,2.0350723340362249,1.9686998072928457,2.0858456765056492,2.1150393198028121,2.0960407823683633,1.9709648894580449,1.9558237270696361]
[null,"SGN - Southern",4.3724011747736116,4.1057641662653896,4.0545669929819539,4.1740927460581894,4.2397101975440528,4.2461477210751069,4.1078523076276792,4.0575944965475035]
[null,"WWU",1.3982776671905828,1.3864649866746799,1.3673040530931269,1.3493453776780693,1.3347777856873293,1.3354887108693174,1.3597799661606067,1.3515240072037848]
[null,"NGGT (TO)",-1.1295718210052885,-1.1444007312827333,-1.1763817360750841,-1.5927557463957547,-1.8565667598967899,-1.2720416735170972,-1.1039739947823479,-1.018311326547777]
[null,"NGGT (SO)",-0.43181154987245485,-0.39947195996305995,-0.34734317043598018,-0.3193206524905472,-0.31265626882301373,-0.30799379948941219,-0.32570922921081308,-0.31552026220892354]
[null,"NGET (TO)",15.168246288518162,16.275110005972994,15.614702904478012,14.911674359737152,13.033415757853545,12.556067765830047,11.285100906339711,9.8268179419485548]
[null,"NGET (SO)",0.93219394583370063,0.89969793099769957,0.87783267686821997,0.87232109317784756,0.89875958568159287,0.82801710222961222,0.88417658562860901,0.89982415652833247]
[null,"SPT",10.952751093909903,1.3412683602121493,22.190179414419269,7.0488483253947072,6.9020695692988534,6.9425238085580094,7.0785069781779111,5.2688524500291916]
[null,"SHET",4.7850556060781999,4.9736597194598335,5.6988662496343032,3.7921077312788807,2.8512563802087829,2.8799765245720623,2.9074703511454074,2.8191074376225309]
[]
[]
[null,{"$f":"LEFT('RFPR cover'!C6,2)","v":"GD"}]
[null,"Output incentives for each sector used to populate R5"]
[]
[null,"Input for R5 - Output Incentives",null,null,{"$f":"OR((LEFT('RFPR cover'!$C$6,2)=Data!F152),'RFPR cover'!$C$5=Data!F152)","v":false},{"$f":"B162","v":"ED"}]
[null,{"$f":"CHOOSE(MATCH(TRUE,$E$152:$E$159,0),B163,B173,B183,E183,B193,E193,B203,E203)&\"\"","v":"Broad Measure of Customer Satisfaction "},null,null,{"$f":"OR((LEFT('RFPR cover'!$C$6,2)=Data!F153),'RFPR cover'!$C$5=Data!F153)","v":true},{"$f":"B172","v":"GD"}]
[null,"Shrinkage Allowance Revenue Adjustment",null,null,{"$f":"OR((LEFT('RFPR cover'!$C$6,2)=Data!F154),'RFPR cover'!$C$5=Data!F154)","v":false},{"$f":"B182","v":"NGGT (TO)"}]
[null,"Environment Emissions Incentive ",null,null,{"$f":"OR((LEFT('RFPR cover'!$C$6,2)=Data!F155),'RFPR cover'!$C$5=Data!F155)","v":false},{"$f":"E182","v":"NGGT (SO)"}]
[null,"Discretionary Reward Scheme",null,null,{"$f":"OR((LEFT('RFPR cover'!$C$6,2)=Data!F156),'RFPR cover'!$C$5=Data!F156)","v":false},{"$f":"B192","v":"NGET (TO)"}]
[null,"NTS Exit Capacity",null,null,{"$f":"OR((LEFT('RFPR cover'!$C$6,2)=Data!F157),'RFPR cover'!$C$5=Data!F157)","v":false},{"$f":"E192","v":"NGET (SO)"}]
[null,"",null,null,{"$f":"OR((LEFT('RFPR cover'!$C$6,2)=Data!F158),'RFPR cover'!$C$5=Data!F158)","v":false},{"$f":"B202","v":"SPT"}]
[null,"",null,null,{"$f":"OR((LEFT('RFPR cover'!$C$6,2)=Data!F159),'RFPR cover'!$C$5=Data!F159)","v":false},{"$f":"E202","v":"SHET"}]
[null,""]
[]
[null,"ED"]
[null,"Broad measure of customer service"]
[null,"Interruptions-related quality of service"]
[null,"Incentive on connections engagement"]
[null,"Time to Connect Incentive"]
[null,"Losses discretionary reward scheme"]
[]
[]
[]
[]
[null,"GD"]
[null,"Broad Measure of Customer Satisfaction "]
[null,"Shrinkage Allowance Revenue Adjustment"]
[null,"Environment Emissions Incentive "]
[null,"Discretionary Reward Scheme"]
[null,"NTS Exit Capacity"]
[]
[]
[]
[]
[null,{"$f":"B95","v":"NGGT (TO)"},null,null,{"$f":"B96","v":"NGGT (SO)"}]
[null,"Stakeholder Satisfaction Output",null,null,"Constraint management"]
[null,"Permits revenue adjustment",null,null,"Transportation Support Services"]
[null,null,null,null,"Shrinkage incentive"]
[null,null,null,null,"Residual balancing"]
[null,null,null,null,"Quality of demand forecasting"]
[null,null,null,null,"Greenhouse gas incentive"]
[null,null,null,null,"Maintenance incentive"]
[]
[]
[null,{"$f":"B97","v":"NGET (TO)"},null,null,{"$f":"B98","v":"NGET (SO)"}]
[null,"Network Reliability Incentive",null,null,"Electricity Market Reform incentive revenue"]
[null,"Stakeholder Satisfaction Output",null,null,"Balancing Services Incentive Scheme / ESO Incentive Scheme 18/19"]
[null,"SF6 Emissions",null,null,"Renewable wind forecasting incentive"]
[null,"Environmental Discretionary Reward"]
[]
[]
[]
[]
[]
[null,{"$f":"B145","v":"SPT"},null,null,{"$f":"B100","v":"SHET"}]
[null,"Network Reliability Incentive",null,null,"Network Reliability Incentive"]
[null,"Stakeholder Satisfaction Output",null,null,"Stakeholder Satisfaction Output"]
[null,"SF6 Emissions",null,null,"SF6 Emissions"]
[null,"Environmental Discretionary Reward",null,null,"Environmental Discretionary Reward"]
[null,"Performance re offers of timely connection ",null,null,"Performance re offers of timely connection "]
[]
[]
[]
[]
[null,"All incentive performance recognised in t+2 allowed revenue - except TTC (t+3) and LDR (t+1) in ED"]
[]
[null,"Time to Connect Incentive revenue adjustment","t+3"]
[null,"Losses discretionary reward scheme revenue adjustment","t+1"]
[]
[]
[null,"Bond or loan types"]
[null,"Fixed rate"]
[null,"Floating"]
[null,"Inflation-linked"]
[]
[]
[null,"Reference rate"]
[null,"Not applicable"]
[null,"LIBOR 3 month"]
[null,"LIBOR 6 month"]
[null,"EURIBOR 3 month"]
[null,"BOE base rate"]
[null,"RPI 12 month"]
[null,"CPI 12 month"]
[]
[]
[]
[null,"Currency"]
[null,"GBP"]
[null,"EUR"]
[null,"USD"]
[null,"HKD"]
[null,"CAD"]
[]
[]
[null,"Rank"]
[null,"Senior"]
[null,"Junior"]
[]
[]
[null,"Hedged"]
[null,"Yes - fully hedged"]
[null,"Yes - partially hedged"]
[null,"No"]
[]
[null,"Special features"]
[null,"Callable"]
[null,"Puttable"]
[]
[]
[]
[null,"Counterparty"]
[null,"EIB"]
[null,"RBS"]
[]
[]
[]
[null,"Swap legs"]
[null,"Fixed rate"]
[null,"Floating"]

{"sheet":"Content & Version Control","index":2,"n_rows":35,"n_cols":9,"rows_kept":35,"cut":false,"hidden":false,"merged":[[12,3,12,7],[7,3,7,7],[8,3,8,7],[9,3,9,7],[10,3,10,7],[11,3,11,7],[13,3,13,7],[14,3,14,7],[15,3,15,7],[16,3,16,7],[17,3,17,7]]}
["Version control",null,null,null,null,null,null,null," "]
[{"$f":"'RFPR cover'!C5","v":"Cadent-London"}]
[{"$f":"'RFPR cover'!C7","v":2020}]
[]
[]
[null,"Version:"]
[]
[null,"Submission","Date submitted","Changes"]
[null,"Submission 1"]
[null,"Submission 2"]
[null,"Submission 3"]
[null,"Submission 4"]
[null,"Submission 5"]
[null,"Submission 6"]
[null,"Submission 7"]
[null,"Submission 8"]
[null,"Submission 9"]
[null,"Submission 10"]
[]
[]
[null,"R1 - RoRE"]
[null,"R2 - Revenue"]
[null,"R3 - Rec to totex"]
[null,"R4 - Totex"]
[null,"R5 - Output Incentives"]
[null,"R6 - Innovation"]
[null,"R7 - Financing"]
[null,"R7a - Financing input"]
[null,"R8 - Net Debt"]
[null,"R8a - Net Debt input"]
[null,"R9 - RAV"]
[null,"R10 - Tax"]
[null,"R11 - Dividends"]
[null,"R12 - Pensions"]
[null,"R13 - Other Activities"]

{"sheet":"Change log","index":3,"n_rows":25,"n_cols":3,"rows_kept":25,"cut":false,"hidden":false,"merged":[]}
["Change log"]
[{"$f":"'RFPR cover'!C5","v":"Cadent-London"}]
[{"$f":"'RFPR cover'!C7","v":2020}]
[]
["Version","Table Reference","Changes made to RFPR template"]
[1.1000000000000001,"R8","Row 26 added to pick up unamortised issues costs row in table R8a."]
[1.1000000000000001,"R8","Row 42 updated to include new row 26 (unamortised issue costs) in the subtotal"]
[1.1000000000000001,"R1","Amended formating to percentages (Column M:N, rows 10-23 and rows 29-42)"]
[1.1000000000000001,"R7","B29 to add \"Net Interest\" into the title to make it clear that this should include regulatory definition of net interest associated with new/refinanced debt raised in future years"]
[1.1000000000000001,"R7","Row 47 added to allow input of issuance expenses forecast for new/refinanced debt in future years"]
[1.1000000000000001,"R8a","Additional row added for restricted cash balances in table R8a in row 18, guidance updated."]
[1.1000000000000001,"R7","D37 - formula amended to read =('R8 - Net Debt'!D54-AVERAGE('R8 - Net Debt'!D8,('R8 - Net Debt'!E10-'R8a - Net Debt input'!T18)))*(Data!C36-1)"]
[1.1000000000000001,"R7","E37 - formula amended to read =('R8 - Net Debt'!E54-AVERAGE(('R8 - Net Debt'!E8-'R8a - Net Debt input'!T18),('R8 - Net Debt'!E10-'R8a - Net Debt input'!U18)))*(Data!D36-1)\n\nFormula copied across to F37:K37"]
[1.1000000000000001,"R10 ","Amended formula in D50 to read =D85-D87, and dragged formula across to E5:K5"]
[1.1000000000000001,"R1","Amended formula in B3 to correct spelling of system, originally spelt 'syestem'"]
[1.1000000000000001,"R9","Formula in row 32 changed from =IF(D5=\"Actuals\",IF(D31>=0,(D29-SUM($D$31:D31))-D11<'RFPR cover'!$F$14,(D29-SUM($D$31:D31))-D11<'RFPR cover'!$F$14), \"NA\") to =IF(D5=\"Actuals\",IF(ABS((D29-SUM($D$31:D31))-D11)<'RFPR cover'!$F$14,\"TRUE\",\"FALSE\"),\"NA\")"]
[1.1000000000000001,"R8a","Removed content in F12 (\"Income statement debits and cash out flows (entered as +ve values, credits as -ve values\")"]
[1.1000000000000001,"R8a","Changed \"Restricted cash balances (entered as +ve values, credits as -ve values)\" in F18 to \"Restricted cash balances (-ive)\""]
[1.1000000000000001,"Data","J63:J68 updated to be consistent with Nov 2019 PCFM"]
[1.1000000000000001,"Data","Populated the incentives for NGGT SO and NGET SO in the Data tab, based on the incentives in the 2019 RFPR template for both entities."]
[1.1000000000000001,"R7a","Removed data validation between rows 498:509"]
[1.1000000000000001,"R10 ","Added in \"Tax arising from MOD values\" in \"Other adjustments\" in R10"]
[1.1000000000000001,"R10 ","Changed the formulas in row 6 from =IF(H6<=('RFPR cover'!$C$7),\"Actuals\",\"Forecast\") to =IF(H6<=('RFPR cover'!$C$7-1),\"Actuals\",\"Forecast\")"]
[1.1000000000000001,"R9","Changed the formulas in row 5 from =IF(D6<='RFPR cover'!$C$7,\"Actuals\",\"Forecast\") to =IF(D6<='RFPR cover'!$C$7-1,\"Actuals\",\"Forecast\")."]
[1.1000000000000001,"Data","Changed the tax rate from G25:G30 to be in line with the 2020 Budget, where Government announced the corporate tax rate would be 19% for the years beginning April 2020 and 2021."]

{"sheet":"R1 - RoRE","index":4,"n_rows":66,"n_cols":15,"rows_kept":66,"cut":false,"hidden":false,"merged":[]}
["R1 - Return on Regulatory Equity (RoRE)",null,null,null,null,null,null,null,null,null,null,null,null,null," "]
[{"$f":"'RFPR cover'!C5","v":"Cadent-London"}]
[{"$f":"'RFPR cover'!C7","v":2020},{"$f":"IF('RFPR cover'!C5=Data!B98,\"Not required to be completed for System Operator\",(IF('RFPR cover'!C5=Data!B96,\"Not required to be completed for System Operator\",\"\")))","v":""}]
[]
[null,null,null,{"$f":"IF(D6<='RFPR cover'!$C$7,\"Actuals\",\"Forecast\")","v":"Actuals"},{"$f":"IF(E6<='RFPR cover'!$C$7,\"Actuals\",\"Forecast\")","v":"Actuals"},{"$f":"IF(F6<='RFPR cover'!$C$7,\"Actuals\",\"Forecast\")","v":"Actuals"},{"$f":"IF(G6<='RFPR cover'!$C$7,\"Actuals\",\"Forecast\")","v":"Actuals"},{"$f":"IF(H6<='RFPR cover'!$C$7,\"Actuals\",\"Forecast\")","v":"Actuals"},{"$f":"IF(I6<='RFPR cover'!$C$7,\"Actuals\",\"Forecast\")","v":"Actuals"},{"$f":"IF(J6<='RFPR cover'!$C$7,\"Actuals\",\"Forecast\")","v":"Actuals"},{"$f":"IF(K6<='RFPR cover'!$C$7,\"Actuals\",\"Forecast\")","v":"Forecast"}]
[null,null,null,{"$f":"'RFPR cover'!$C$13","v":2014},{"$f":"D6+1","v":2015},2016,2017,2018,2019,2020,2021,null,{"$f":"\"Cumulative to \"&'RFPR cover'!$C$7","v":"Cumulative to 2020"},"RIIO-1 period"]
[]
[null,"RoRE based on Notional Gearing"]
[]
[null,"Allowed Equity Return","%",{"$f":"D48/D$65","v":6.7000000000000004E-2},6.7000000000000004E-2,6.7000000000000004E-2,6.7000000000000004E-2,6.7000000000000004E-2,6.7000000000000004E-2,6.7000000000000004E-2,6.7000000000000004E-2,null,{"$f":"AVERAGE(D48:INDEX(D48:K48,0,MATCH('RFPR cover'!$C$7,$D$6:$K$6,0)))/AVERAGE($D$65:INDEX($D$65:$K$65,0,MATCH('RFPR cover'!$C$7,$D$6:$K$6,0)))","v":6.699999999999999E-2},{"$f":"AVERAGE(D48:K48)/AVERAGE($D$65:$K$65)","v":6.7000000000000004E-2}]
[null,{"$f":"B49","v":"Totex outperformance"},"%",2.4848155433337463E-2,3.7388443847074279E-2,2.1288021217881394E-2,2.9819284200873226E-2,2.9380186407513231E-2,2.8922211576252492E-3,-1.2852819725908194E-2,2.4423808122785635E-3,null,{"$f":"AVERAGE(D49:INDEX(D49:K49,0,MATCH('RFPR cover'!$C$7,$D$6:$K$6,0)))/AVERAGE($D$65:INDEX($D$65:$K$65,0,MATCH('RFPR cover'!$C$7,$D$6:$K$6,0)))","v":1.8552013254280571E-2},1.6366368887959712E-2]
[null,"IQI Reward","%",1.6721879723402644E-3,1.7122667356789913E-3,1.8303691342660489E-3,1.7606117295239287E-3,1.7889271787030045E-3,1.7292925528469478E-3,1.6737635902372653E-3,1.602715712401443E-3,null,{"$f":"AVERAGE(D50:INDEX(D50:K50,0,MATCH('RFPR cover'!$C$7,$D$6:$K$6,0)))/AVERAGE($D$65:INDEX($D$65:$K$65,0,MATCH('RFPR cover'!$C$7,$D$6:$K$6,0)))","v":1.7377421837211518E-3},1.7194227188043326E-3]
[null,"Broad Measure of Customer Satisfaction ","%",6.1771934495761659E-4,1.1958559521028254E-4,1.3690578853070112E-3,1.2791259199828751E-3,1.2161982800594493E-3,1.5099634520059828E-3,2.198889961288893E-3,2.8791319741930483E-3,null,{"$f":"AVERAGE(D51:INDEX(D51:K51,0,MATCH('RFPR cover'!$C$7,$D$6:$K$6,0)))/AVERAGE($D$65:INDEX($D$65:$K$65,0,MATCH('RFPR cover'!$C$7,$D$6:$K$6,0)))","v":1.2018008935136186E-3},1.4293696627043749E-3]
[null,"Shrinkage Allowance Revenue Adjustment","%",7.0438890216214958E-4,4.9123303529003597E-4,3.5692482896738486E-4,2.936141683165651E-4,4.5478963569540385E-4,7.9117743803208121E-4,4.344039516445135E-4,2.8481444016787767E-4,null,{"$f":"AVERAGE(D52:INDEX(D52:K52,0,MATCH('RFPR cover'!$C$7,$D$6:$K$6,0)))/AVERAGE($D$65:INDEX($D$65:$K$65,0,MATCH('RFPR cover'!$C$7,$D$6:$K$6,0)))","v":5.0437695496912132E-4},4.7458821985934987E-4]
[null,"Environment Emissions Incentive ","%",2.2173763303727154E-3,2.1610292867192959E-3,2.0272402995760775E-3,1.7682605237825787E-3,2.3836024965696177E-3,3.3597042021870946E-3,3.7643057584583425E-3,4.6036230814639357E-3,null,{"$f":"AVERAGE(D53:INDEX(D53:K53,0,MATCH('RFPR cover'!$C$7,$D$6:$K$6,0)))/AVERAGE($D$65:INDEX($D$65:$K$65,0,MATCH('RFPR cover'!$C$7,$D$6:$K$6,0)))","v":2.5437724354981698E-3},2.8232388340039055E-3]
[null,"Discretionary Reward Scheme","%",6.620893704356736E-5,6.6222233935620282E-5,4.2348618970759306E-5,4.1852824400626241E-5,4.1203708608612046E-5,0,0,0,null,{"$f":"AVERAGE(D54:INDEX(D54:K54,0,MATCH('RFPR cover'!$C$7,$D$6:$K$6,0)))/AVERAGE($D$65:INDEX($D$65:$K$65,0,MATCH('RFPR cover'!$C$7,$D$6:$K$6,0)))","v":3.6163928801503081E-5},3.1257455141498765E-5]
[null,"NTS Exit Capacity","%",1.5881542720366602E-3,1.7804958418209276E-3,6.3375047908764918E-3,4.5763080686265578E-3,4.3658188370091743E-3,4.1956132785167495E-3,3.2293681156338877E-3,2.3068907418430677E-3,null,{"$f":"AVERAGE(D55:INDEX(D55:K55,0,MATCH('RFPR cover'!$C$7,$D$6:$K$6,0)))/AVERAGE($D$65:INDEX($D$65:$K$65,0,MATCH('RFPR cover'!$C$7,$D$6:$K$6,0)))","v":3.7294132881604079E-3},3.5364151921134378E-3]
[null,"Network Innovation ","%",-9.8977195032398947E-5,-2.3783892940016507E-4,-3.5723896183447823E-4,-4.0697894492769155E-4,-3.2731897818982726E-4,-2.1100309132940099E-4,-3.3231022538826046E-4,-2.4242221764041608E-4,null,{"$f":"AVERAGE(D56:INDEX(D56:K56,0,MATCH('RFPR cover'!$C$7,$D$6:$K$6,0)))/AVERAGE($D$65:INDEX($D$65:$K$65,0,MATCH('RFPR cover'!$C$7,$D$6:$K$6,0)))","v":-2.8226137606433561E-4},-2.7685627247294776E-4]
[null,"Penalties and fines","%",-1.7623730938396134E-3,-2.160503009766532E-3,-1.9707317599446991E-3,-1.490150617757422E-3,-1.8713324841490313E-3,-1.2317008826782133E-2,-3.3206151464348476E-3,-2.3242923590526426E-3,null,{"$f":"AVERAGE(D57:INDEX(D57:K57,0,MATCH('RFPR cover'!$C$7,$D$6:$K$6,0)))/AVERAGE($D$65:INDEX($D$65:$K$65,0,MATCH('RFPR cover'!$C$7,$D$6:$K$6,0)))","v":-3.606829916149557E-3},-3.4328240226969425E-3]
[null,"RoRE - Operational performance","%",{"$f":"SUM(D10:D19)","v":9.6852840903378451E-2},0.10832093463656277,9.7923496054066014E-2,0.10464192787282124,0.10443207508181965,6.8949960163102564E-2,6.1794986279531589E-2,7.8552842185654892E-2,null,{"$f":"SUM(M10:M19)","v":9.1416191646730635E-2},{"$f":"SUM(N10:N19)","v":8.967098067541672E-2}]
[null,"Debt performance - at notional gearing","%",{"$f":"(D59)/D$65","v":2.3142937324712884E-2},{"$f":"(E59)/E$65","v":-1.0777010736478382E-2},7.2381309893468238E-3,1.3952221756864157E-2,3.7986970143911766E-2,1.9407976677120197E-2,1.1199584546724159E-3,{"$f":"(K59)/K$65","v":-9.8167136946068108E-3},null,{"$f":"AVERAGE(D59:INDEX(D59:K59,0,MATCH('RFPR cover'!$C$7,$D$6:$K$6,0)))/AVERAGE($D$65:INDEX($D$65:$K$65,0,MATCH('RFPR cover'!$C$7,$D$6:$K$6,0)))","v":1.3174560808310394E-2},{"$f":"AVERAGE(D59:K59)/AVERAGE($D$65:$K$65)","v":1.0055262477156631E-2}]
[null,{"$f":"B61","v":"Tax performance - at notional gearing"},"%",{"$f":"(D61)/D$65","v":-2.7237520732653793E-3},-5.8428810862699325E-3,-6.3990901402308118E-3,-5.6420797536605085E-3,-5.0378547750888616E-3,-2.1959860092430742E-3,-1.2344253759120013E-3,1.4002639754834168E-4,null,{"$f":"AVERAGE(D61:INDEX(D61:K61,0,MATCH('RFPR cover'!$C$7,$D$6:$K$6,0)))/AVERAGE($D$65:INDEX($D$65:$K$65,0,MATCH('RFPR cover'!$C$7,$D$6:$K$6,0)))","v":-4.1142385090884338E-3},{"$f":"AVERAGE(D61:K61)/AVERAGE($D$65:$K$65)","v":-3.5370490443689235E-3}]
[null,{"$f":"B63","v":"RoRE - including financing and tax"},"%",{"$f":"SUM(D20:D22)","v":0.11727202615482596},9.1701042813814457E-2,9.8762536903182027E-2,0.11295206987602489,0.13738119045064254,8.6161950830979689E-2,6.1680519358292003E-2,6.8876154888596428E-2,null,{"$f":"SUM(M20:M22)","v":0.1004765139459526},{"$f":"SUM(N20:N22)","v":9.6189194108204423E-2}]
[]
[]
[]
[null,"RoRE based on Actual Gearing"]
[]
[null,"Allowed Equity Return","%",{"$f":"D48/D$66","v":5.1217185067495126E-2},5.643410693665956E-2,5.3927474752262977E-2,5.8780943753420065E-2,6.493060586356604E-2,6.410272515236419E-2,6.4918141259279943E-2,6.5253413367112795E-2,null,{"$f":"AVERAGE(D48:INDEX(D48:K48,0,MATCH('RFPR cover'!$C$7,$D$6:$K$6,0)))/AVERAGE($D$66:INDEX($D$66:$K$66,0,MATCH('RFPR cover'!$C$7,$D$6:$K$6,0)))","v":5.8846798986096072E-2},{"$f":"AVERAGE(D48:K48)/AVERAGE($D$66:$K$66)","v":5.9641247830109441E-2}]
[null,{"$f":"B49","v":"Totex outperformance"},"%",1.8994814558434769E-2,3.1492290123299724E-2,1.7134466070939363E-2,2.6161278617593677E-2,2.8472735877975251E-2,2.767153103688118E-3,-1.2453450246963701E-2,2.3787117125898182E-3,null,{"$f":"AVERAGE(D49:INDEX(D49:K49,0,MATCH('RFPR cover'!$C$7,$D$6:$K$6,0)))/AVERAGE($D$66:INDEX($D$66:$K$66,0,MATCH('RFPR cover'!$C$7,$D$6:$K$6,0)))","v":1.629442678749312E-2},1.4568815864564145E-2]
[null,"IQI Reward","%",1.2782800126416528E-3,1.4422424487372117E-3,1.4732415712754297E-3,1.5446331200710097E-3,1.7336735158057603E-3,1.6545129137787778E-3,1.6217555400845124E-3,1.5609353864372839E-3,null,{"$f":"AVERAGE(D50:INDEX(D50:K50,0,MATCH('RFPR cover'!$C$7,$D$6:$K$6,0)))/AVERAGE($D$66:INDEX($D$66:$K$66,0,MATCH('RFPR cover'!$C$7,$D$6:$K$6,0)))","v":1.5262770891805711E-3},1.5305748730885041E-3]
[null,"Broad Measure of Customer Satisfaction ","%",4.7220665687262853E-4,1.0072695922658461E-4,1.1019378290191102E-3,1.1222123694933593E-3,1.1786341966341343E-3,1.4446682411052921E-3,2.130564912247238E-3,2.8040774455297089E-3,null,{"$f":"AVERAGE(D51:INDEX(D51:K51,0,MATCH('RFPR cover'!$C$7,$D$6:$K$6,0)))/AVERAGE($D$66:INDEX($D$66:$K$66,0,MATCH('RFPR cover'!$C$7,$D$6:$K$6,0)))","v":1.0555542627150233E-3},1.2723789596147993E-3]
[null,"Shrinkage Allowance Revenue Adjustment","%",5.3845995166460501E-4,4.1376563648324997E-4,2.8728439854618548E-4,2.5759578974661522E-4,4.4074278486825452E-4,7.5696462473018127E-4,4.2090592681265582E-4,2.7738976712234829E-4,null,{"$f":"AVERAGE(D52:INDEX(D52:K52,0,MATCH('RFPR cover'!$C$7,$D$6:$K$6,0)))/AVERAGE($D$66:INDEX($D$66:$K$66,0,MATCH('RFPR cover'!$C$7,$D$6:$K$6,0)))","v":4.4299954152667335E-4},4.224631886251038E-4]
[null,"Environment Emissions Incentive ","%",1.6950414011489936E-3,1.8202351919398491E-3,1.6317007473456559E-3,1.5513436177590574E-3,2.3099814065697592E-3,3.2144208218812284E-3,3.6473392980704419E-3,4.4836137301663848E-3,null,{"$f":"AVERAGE(D53:INDEX(D53:K53,0,MATCH('RFPR cover'!$C$7,$D$6:$K$6,0)))/AVERAGE($D$66:INDEX($D$66:$K$66,0,MATCH('RFPR cover'!$C$7,$D$6:$K$6,0)))","v":2.234221868330341E-3},2.5131565221256139E-3]
[null,"Discretionary Reward Scheme","%",5.0612468383321233E-5,5.5778994500108675E-5,3.4085881796101899E-5,3.6718634582313099E-5,3.9931071101238979E-5,0,0,0,null,{"$f":"AVERAGE(D54:INDEX(D54:K54,0,MATCH('RFPR cover'!$C$7,$D$6:$K$6,0)))/AVERAGE($D$66:INDEX($D$66:$K$66,0,MATCH('RFPR cover'!$C$7,$D$6:$K$6,0)))","v":3.17631559511872E-5},2.7824382516905317E-5]
[null,"NTS Exit Capacity","%",1.2140416606960392E-3,1.4997118319044764E-3,5.1009795463035469E-3,4.0149210026904488E-3,4.2309740623518652E-3,4.0141827587816233E-3,3.1290235150587377E-3,2.2467536592574804E-3,null,{"$f":"AVERAGE(D55:INDEX(D55:K55,0,MATCH('RFPR cover'!$C$7,$D$6:$K$6,0)))/AVERAGE($D$66:INDEX($D$66:$K$66,0,MATCH('RFPR cover'!$C$7,$D$6:$K$6,0)))","v":3.2755825985738975E-3},3.1480032075074868E-3]
[null,"Network Innovation ","%",-7.566169127516323E-5,-2.0033175485775434E-4,-2.8753724022169343E-4,-3.5705382791971458E-4,-3.1720924723147525E-4,-2.0187870402668342E-4,-3.2198450975609328E-4,-2.36102644433765E-4,null,{"$f":"AVERAGE(D56:INDEX(D56:K56,0,MATCH('RFPR cover'!$C$7,$D$6:$K$6,0)))/AVERAGE($D$66:INDEX($D$66:$K$66,0,MATCH('RFPR cover'!$C$7,$D$6:$K$6,0)))","v":-2.479131113253258E-4},-2.4644856059521464E-4]
[null,"Penalties and fines","%",-1.3472207299277227E-3,-1.8197919088080493E-3,-1.5862177198194109E-3,-1.3073501439779579E-3,-1.8135336114622192E-3,-1.1784385545111324E-2,-3.2174352708054027E-3,-2.26370164315349E-3,null,{"$f":"AVERAGE(D57:INDEX(D57:K57,0,MATCH('RFPR cover'!$C$7,$D$6:$K$6,0)))/AVERAGE($D$66:INDEX($D$66:$K$66,0,MATCH('RFPR cover'!$C$7,$D$6:$K$6,0)))","v":-3.1679163440700114E-3},-3.0557896760421131E-3]
[null,"RoRE - Operational performance","%",{"$f":"SUM(D29:D38)","v":7.4037759356134242E-2},9.1238734459084952E-2,7.8817415837447266E-2,9.1805242933458889E-2,0.10120653592017861,6.5968363367191404E-2,5.9874860424028321E-2,7.6505090780628573E-2,null,{"$f":"SUM(M29:M38)","v":8.0291794834471547E-2},{"$f":"SUM(N29:N38)","v":7.9822226591514639E-2}]
[null,"Debt performance - at actual gearing","%",{"$f":"(D59+D60)/D$66","v":2.0281100911249055E-2},-4.8747527234118942E-3,8.5419092269309639E-3,1.3727795220226704E-2,3.6886928348604985E-2,1.9000506719289056E-2,2.0727854187672871E-3,-8.7379723645530701E-3,null,{"$f":"(AVERAGE(D59:INDEX(D59:K59,0,MATCH('RFPR cover'!$C$7,$D$6:$K$6,0)))+AVERAGE(D60:INDEX(D60:K60,0,MATCH('RFPR cover'!$C$7,$D$6:$K$6,0))))/AVERAGE($D$66:INDEX($D$66:$K$66,0,MATCH('RFPR cover'!$C$7,$D$6:$K$6,0)))","v":1.3421382880736465E-2},{"$f":"(AVERAGE(D59:K59)+AVERAGE(D60:K60))/AVERAGE($D$66:$K$66)","v":1.0673523697754398E-2}]
[null,"Tax performance - at actual gearing","%",{"$f":"(D61+D62)/D$66","v":-2.0821330449911405E-3},-4.9214593438916864E-3,-5.1505488354440616E-3,-4.9499518306302748E-3,-4.8822531761071441E-3,-2.1010251878947187E-3,-1.19606867055963E-3,1.3637612539596432E-4,null,{"$f":"(AVERAGE(D61:INDEX(D61:K61,0,MATCH('RFPR cover'!$C$7,$D$6:$K$6,0)))+AVERAGE(D62:INDEX(D62:K62,0,MATCH('RFPR cover'!$C$7,$D$6:$K$6,0))))/AVERAGE($D$66:INDEX($D$66:$K$66,0,MATCH('RFPR cover'!$C$7,$D$6:$K$6,0)))","v":-3.613578604853473E-3},{"$f":"(AVERAGE(D61:K61)+AVERAGE(D62:K62))/AVERAGE($D$66:$K$66)","v":-3.1485674424247571E-3}]
[null,{"$f":"B63","v":"RoRE - including financing and tax"},"%",{"$f":"SUM(D39:D41)","v":9.2236727222392165E-2},8.1442522391781375E-2,8.2208776228934161E-2,0.10058308632305531,0.13321121109267647,8.2867844898585744E-2,6.0751577172235977E-2,6.7903494541471474E-2,null,{"$f":"SUM(M39:M41)","v":9.0099599110354534E-2},{"$f":"SUM(N39:N41)","v":8.7347182846844285E-2}]
[]
[]
[null,"RoRE input values"]
[null,{"$f":"\"Input values provided in \"&'RFPR cover'!C14&\" prices\"","v":"Input values provided in £m 09/10 prices"}]
[]
[null,"Equity Return on the RAV",{"$f":"'RFPR cover'!$C$14","v":"£m 09/10"},{"$f":"'R9 - RAV'!D50","v":37.714809634449274},{"$f":"'R9 - RAV'!E50","v":37.70723680395561},{"$f":"'R9 - RAV'!F50","v":37.899460916412416},{"$f":"'R9 - RAV'!G50","v":38.348423374799012},{"$f":"'R9 - RAV'!H50","v":38.952557518350972},{"$f":"'R9 - RAV'!I50","v":39.788689160721844},{"$f":"'R9 - RAV'!J50","v":40.828279340436687},{"$f":"'R9 - RAV'!K50","v":42.576378789282785},null,{"$f":"SUM(D48:INDEX(D48:K48,0,MATCH('RFPR cover'!$C$7,$D$6:$K$6,0)))","v":271.23945674912579},{"$f":"SUM(D48:K48)","v":313.81583553840858}]
[null,"Totex outperformance",{"$f":"'RFPR cover'!$C$14","v":"£m 09/10"},{"$f":"'R4 - Totex'!D35+'R4 - Totex'!D63","v":13.987215700530282},{"$f":"'R4 - Totex'!E35+'R4 - Totex'!E63","v":21.04201352049294},{"$f":"'R4 - Totex'!F35+'R4 - Totex'!F63","v":12.041858628878419},{"$f":"'R4 - Totex'!G35+'R4 - Totex'!G63","v":17.067500526396142},{"$f":"'R4 - Totex'!H35+'R4 - Totex'!H63","v":17.081095536396006},{"$f":"'R4 - Totex'!I35+'R4 - Totex'!I63","v":1.7175774421614047},{"$f":"'R4 - Totex'!J35+'R4 - Totex'!J63","v":-7.8322166280843977},{"$f":"'R4 - Totex'!K35+'R4 - Totex'!K63","v":1.5520556807648997},null,{"$f":"SUM(D49:INDEX(D49:K49,0,MATCH('RFPR cover'!$C$7,$D$6:$K$6,0)))","v":75.105044726770799},76.657100407535694]
[null,"IQI Reward",{"$f":"'RFPR cover'!$C$14","v":"£m 09/10"},{"$f":"'R4 - Totex'!D79","v":0.94128732910192237},{"$f":"'R4 - Totex'!E79","v":0.96365443692214614},{"$f":"'R4 - Totex'!F79","v":1.0353731860705035},{"$f":"'R4 - Totex'!G79","v":1.0077117015286676},{"$f":"'R4 - Totex'!H79","v":1.0400490869338821},{"$f":"'R4 - Totex'!I79","v":1.0269594604951993},{"$f":"'R4 - Totex'!J79","v":1.0199535434635711},{"$f":"'R4 - Totex'!K79","v":1.018475093473717},null,{"$f":"SUM(D50:INDEX(D50:K50,0,MATCH('RFPR cover'!$C$7,$D$6:$K$6,0)))","v":7.0349887445158918},8.0534638379896091]
[null,{"$f":"'R5 - Output Incentives'!B39","v":"Broad Measure of Customer Satisfaction "},{"$f":"'RFPR cover'!$C$14","v":"£m 09/10"},{"$f":"'R5 - Output Incentives'!D39","v":0.34771891794915244},{"$f":"'R5 - Output Incentives'!E39","v":6.7302124730389601E-2},{"$f":"'R5 - Output Incentives'!F39","v":0.77442620621640745},{"$f":"'R5 - Output Incentives'!G39","v":0.73212630342063545},{"$f":"'R5 - Output Incentives'!H39","v":0.70707512623485391},{"$f":"'R5 - Output Incentives'!I39","v":0.89670845426741164},{"$f":"'R5 - Output Incentives'!J39","v":1.3399536354982824},{"$f":"'R5 - Output Incentives'!K39","v":1.8295972166802801},null,{"$f":"SUM(D51:INDEX(D51:K51,0,MATCH('RFPR cover'!$C$7,$D$6:$K$6,0)))","v":4.8653107683171326},6.6949079849974122]
[null,{"$f":"'R5 - Output Incentives'!B40","v":"Shrinkage Allowance Revenue Adjustment"},{"$f":"'RFPR cover'!$C$14","v":"£m 09/10"},{"$f":"'R5 - Output Incentives'!D40","v":0.39650587095021173},{"$f":"'R5 - Output Incentives'!E40","v":0.27646328936727266},{"$f":"'R5 - Output Incentives'!F40","v":0.20189938217233713},{"$f":"'R5 - Output Incentives'!G40","v":0.16805433485736021},{"$f":"'R5 - Output Incentives'!H40","v":0.26440626034589704},{"$f":"'R5 - Output Incentives'!I40","v":0.4698494500423096},{"$f":"'R5 - Output Incentives'!J40","v":0.26471590872136935},{"$f":"'R5 - Output Incentives'!K40","v":0.18099055954097129},null,{"$f":"SUM(D52:INDEX(D52:K52,0,MATCH('RFPR cover'!$C$7,$D$6:$K$6,0)))","v":2.0418944964567576},2.2228850559977289]
[null,{"$f":"'R5 - Output Incentives'!B41","v":"Environment Emissions Incentive "},{"$f":"'RFPR cover'!$C$14","v":"£m 09/10"},{"$f":"'R5 - Output Incentives'!D41","v":1.2481780028050844},{"$f":"'R5 - Output Incentives'!E41","v":1.2162155679792206},{"$f":"'R5 - Output Incentives'!F41","v":1.1467360373426827},{"$f":"'R5 - Output Incentives'!G41","v":1.0120896000441519},{"$f":"'R5 - Output Incentives'!H41","v":1.3857822887837761},{"$f":"'R5 - Output Incentives'!I41","v":1.9951974055640787},{"$f":"'R5 - Output Incentives'!J41","v":2.2938824929724118},{"$f":"'R5 - Output Incentives'!K41","v":2.9254567182013997},null,{"$f":"SUM(D53:INDEX(D53:K53,0,MATCH('RFPR cover'!$C$7,$D$6:$K$6,0)))","v":10.298081395491407},13.223538113692806]
[null,{"$f":"'R5 - Output Incentives'!B42","v":"Discretionary Reward Scheme"},{"$f":"'RFPR cover'!$C$14","v":"£m 09/10"},{"$f":"'R5 - Output Incentives'!D42","v":3.7269514279065365E-2},{"$f":"'R5 - Output Incentives'!E42","v":3.7269514279065365E-2},{"$f":"'R5 - Output Incentives'!F42","v":2.3955072082781099E-2},{"$f":"'R5 - Output Incentives'!G42","v":2.3955072082781099E-2},{"$f":"'R5 - Output Incentives'!H42","v":2.3955072082781099E-2},{"$f":"'R5 - Output Incentives'!I42","v":0},{"$f":"'R5 - Output Incentives'!J42","v":0},{"$f":"'R5 - Output Incentives'!K42","v":0},null,{"$f":"SUM(D54:INDEX(D54:K54,0,MATCH('RFPR cover'!$C$7,$D$6:$K$6,0)))","v":0.14640424480647402},0.14640424480647402]
[null,{"$f":"'R5 - Output Incentives'!B43","v":"NTS Exit Capacity"},{"$f":"'RFPR cover'!$C$14","v":"£m 09/10"},{"$f":"'R5 - Output Incentives'!D43","v":0.89398412000000005},{"$f":"'R5 - Output Incentives'!E43","v":1.0020534080000001},{"$f":"'R5 - Output Incentives'!F43","v":3.5848957482000001},{"$f":"'R5 - Output Incentives'!G43","v":2.6193164076},{"$f":"'R5 - Output Incentives'!H43","v":2.5382061099},{"$f":"'R5 - Output Incentives'!I43","v":2.4916112324999999},{"$f":"'R5 - Output Incentives'!J43","v":1.9679036346000001},{"$f":"'R5 - Output Incentives'!K43","v":1.4659560306000001},null,{"$f":"SUM(D55:INDEX(D55:K55,0,MATCH('RFPR cover'!$C$7,$D$6:$K$6,0)))","v":15.097970660800001},16.563926691400003]
[null,"Network Innovation ",{"$f":"'RFPR cover'!$C$14","v":"£m 09/10"},{"$f":"-'R6 - Innovation'!D28","v":-5.5715015952219171E-2},{"$f":"-'R6 - Innovation'!E28","v":-0.13385446018046723},{"$f":"-'R6 - Innovation'!F28","v":-0.20207707569948585},{"$f":"-'R6 - Innovation'!G28","v":-0.23294031171218096},{"$f":"-'R6 - Innovation'!H28","v":-0.19029718395204645},{"$f":"-'R6 - Innovation'!I28","v":-0.12530651362473041},{"$f":"-'R6 - Innovation'!J28","v":-0.20250230910202049},{"$f":"-'R6 - Innovation'!K28","v":-0.15405164425666129},null,{"$f":"SUM(D56:INDEX(D56:K56,0,MATCH('RFPR cover'!$C$7,$D$6:$K$6,0)))","v":-1.1426928702231507},-1.296744514479812]
[null,"Penalties and fines",{"$f":"'RFPR cover'!$C$14","v":"£m 09/10"},{"$f":"-'R13 - Other Activities'!D8","v":-0.99205321998561824},{"$f":"-'R13 - Other Activities'!E8","v":-1.2159193821630663},{"$f":"-'R13 - Other Activities'!F8","v":-1.1147712136232353},{"$f":"-'R13 - Other Activities'!G8","v":-0.85290935495492393},{"$f":"-'R13 - Other Activities'!H8","v":-1.0879580033548319},{"$f":"-'R13 - Other Activities'!I8","v":-7.314591576100022},{"$f":"-'R13 - Other Activities'!J8","v":-2.0235075041899555},{"$f":"-'R13 - Other Activities'!K8","v":-1.4770142074038952},null,{"$f":"SUM(D57:INDEX(D57:K57,0,MATCH('RFPR cover'!$C$7,$D$6:$K$6,0)))","v":-14.601710254371655},-16.07872446177555]
[null,"RoRE - Operational performance",{"$f":"'RFPR cover'!$C$14","v":"£m 09/10"},{"$f":"SUM(D48:D57)","v":54.519200854127156},60.96243482338312,55.391756888052818,59.893327654061643,60.714871811721288,40.946694516027499,37.65646211431595,49.917844236883496,null,{"$f":"SUM(M48:M57)","v":370.0847486616895},{"$f":"SUM(N48:N57)","v":420.00259289857303}]
[null,"Debt performance - at notional gearing",{"$f":"'RFPR cover'!$C$14","v":"£m 09/10"},{"$f":"'R7 - Financing'!D90+'R10 - Tax'!D90","v":13.027335456470704},{"$f":"'R7 - Financing'!E90+'R10 - Tax'!E90","v":-6.0652432220770507},{"$f":"'R7 - Financing'!F90+'R10 - Tax'!F90","v":4.0943472020690068},{"$f":"'R7 - Financing'!G90+'R10 - Tax'!G90","v":7.9857568201687865},{"$f":"'R7 - Financing'!H90+'R10 - Tax'!H90","v":22.084919992217969},{"$f":"'R7 - Financing'!I90+'R10 - Tax'!I90","v":11.525641063350369},{"$f":"'R7 - Financing'!J90+'R10 - Tax'!J90","v":0.68247726323954017},{"$f":"'R7 - Financing'!K90+'R10 - Tax'!K90","v":-6.2382107571271526},null,{"$f":"SUM(D59:INDEX(D59:K59,0,MATCH('RFPR cover'!$C$7,$D$6:$K$6,0)))","v":53.33523457543933},{"$f":"SUM(D59:K59)","v":47.097023818312181}]
[null,"Debt performance - impact of actual gearing",{"$f":"'RFPR cover'!$C$14","v":"£m 09/10"},{"$f":"'R7 - Financing'!D92+'R10 - Tax'!D91","v":1.9070632036043209},{"$f":"'R7 - Financing'!E92+'R10 - Tax'!E91","v":2.8081091008845576},{"$f":"'R7 - Financing'!F92+'R10 - Tax'!F91","v":1.9087849005338073},{"$f":"'R7 - Financing'!G92+'R10 - Tax'!G91","v":0.97019504947376189},{"$f":"'R7 - Financing'!H92+'R10 - Tax'!H91","v":4.3938641774365239E-2},{"$f":"'R7 - Financing'!I92+'R10 - Tax'!I91","v":0.26801129625008102},{"$f":"'R7 - Financing'!J92+'R10 - Tax'!J91","v":0.62113772709441917},{"$f":"'R7 - Financing'!K92+'R10 - Tax'!K91","v":0.53688109410300755},null,{"$f":"SUM(D60:INDEX(D60:K60,0,MATCH('RFPR cover'!$C$7,$D$6:$K$6,0)))","v":8.5272399196153135},{"$f":"SUM(D60:K60)","v":9.0641210137183208}]
[null,"Tax performance - at notional gearing",{"$f":"'RFPR cover'!$C$14","v":"£m 09/10"},{"$f":"'R10 - Tax'!D83-'R10 - Tax'!D90","v":-1.5332207602185122},{"$f":"'R10 - Tax'!E83-'R10 - Tax'!E90","v":-3.2883418020497572},{"$f":"'R10 - Tax'!F83-'R10 - Tax'!F90","v":-3.6197323383623532},{"$f":"'R10 - Tax'!G83-'R10 - Tax'!G90","v":-3.2293263150411176},{"$f":"'R10 - Tax'!H83-'R10 - Tax'!H90","v":-2.9289153417275813},{"$f":"'R10 - Tax'!I83-'R10 - Tax'!I90","v":-1.3041105182547272},{"$f":"'R10 - Tax'!J83-'R10 - Tax'!J90","v":-0.75223080705460821},{"$f":"'R10 - Tax'!K83-'R10 - Tax'!K90","v":8.8982342425625277E-2},null,{"$f":"SUM(D61:INDEX(D61:K61,0,MATCH('RFPR cover'!$C$7,$D$6:$K$6,0)))","v":-16.655877882708658},{"$f":"SUM(D61:K61)","v":-16.566895540283035}]
[null,"Tax performance - impact of actual gearing",{"$f":"'RFPR cover'!$C$14","v":"£m 09/10"},{"$f":"'R10 - Tax'!D85-'R10 - Tax'!D91","v":8.8817841970012523E-16},{"$f":"'R10 - Tax'!E85-'R10 - Tax'!E91","v":0},{"$f":"'R10 - Tax'!F85-'R10 - Tax'!F91","v":-8.8817841970012523E-16},{"$f":"'R10 - Tax'!G85-'R10 - Tax'!G91","v":4.4408920985006262E-16},{"$f":"'R10 - Tax'!H85-'R10 - Tax'!H91","v":2.4424906541753444E-15},{"$f":"'R10 - Tax'!I85-'R10 - Tax'!I91","v":-2.7755575615628914E-15},{"$f":"'R10 - Tax'!J85-'R10 - Tax'!J91","v":-1.4988010832439613E-15},{"$f":"'R10 - Tax'!K85-'R10 - Tax'!K91","v":0},null,{"$f":"SUM(D62:INDEX(D62:K62,0,MATCH('RFPR cover'!$C$7,$D$6:$K$6,0)))","v":-1.3877787807814457E-15},{"$f":"SUM(D62:K62)","v":-1.3877787807814457E-15}]
[null,"RoRE - including financing and tax",{"$f":"'RFPR cover'!$C$14","v":"£m 09/10"},{"$f":"SUM(D58:D62)","v":67.92037875398367},54.41695890014087,57.775156652293283,65.619953208663063,79.914815103986029,51.436236357373225,38.207846297595303,44.30549691628498,null,{"$f":"SUM(M58:M62)","v":415.29134527403551},{"$f":"SUM(N58:N62)","v":459.59684219032044}]
[]
[null,"NPV-neutral equity element of RAV",{"$f":"'RFPR cover'!$C$14","v":"£m 09/10"},{"$f":"'R9 - RAV'!D46","v":562.90760648431751},{"$f":"'R9 - RAV'!E46","v":562.79457916351657},{"$f":"'R9 - RAV'!F46","v":565.66359576734942},{"$f":"'R9 - RAV'!G46","v":572.36452798207472},{"$f":"'R9 - RAV'!H46","v":581.38145549777562},{"$f":"'R9 - RAV'!I46","v":593.86103224957969},{"$f":"'R9 - RAV'!J46","v":609.37730358860722},{"$f":"'R9 - RAV'!K46","v":635.46834013854902}]
[null,"Equity RAV based on actual gearing",{"$f":"'RFPR cover'!$C$14","v":"£m 09/10"},{"$f":"'R8 - Net Debt'!D62","v":736.37021606610892},{"$f":"'R8 - Net Debt'!E62","v":668.16396769204493},{"$f":"'R8 - Net Debt'!F62","v":702.78575235570486},{"$f":"'R8 - Net Debt'!G62","v":652.39550313561915},{"$f":"'R8 - Net Debt'!H62","v":599.9105814629105},{"$f":"'R8 - Net Debt'!I62","v":620.70199146992718},{"$f":"'R8 - Net Debt'!J62","v":628.9194137178157},{"$f":"'R8 - Net Debt'!K62","v":652.47741983626167}]

{"sheet":"R2 - Revenue","index":5,"n_rows":68,"n_cols":11,"rows_kept":68,"cut":false,"hidden":false,"merged":[]}
["R2 - Revenue"]
[{"$f":"'RFPR cover'!C5","v":"Cadent-London"}]
[{"$f":"'RFPR cover'!C7","v":2020}]
[]
[null,null,null,{"$f":"IF(D6<='RFPR cover'!$C$7,\"Actuals\",\"Forecast\")","v":"Actuals"},{"$f":"IF(E6<='RFPR cover'!$C$7,\"Actuals\",\"Forecast\")","v":"Actuals"},{"$f":"IF(F6<='RFPR cover'!$C$7,\"Actuals\",\"Forecast\")","v":"Actuals"},{"$f":"IF(G6<='RFPR cover'!$C$7,\"Actuals\",\"Forecast\")","v":"Actuals"},{"$f":"IF(H6<='RFPR cover'!$C$7,\"Actuals\",\"Forecast\")","v":"Actuals"},{"$f":"IF(I6<='RFPR cover'!$C$7,\"Actuals\",\"Forecast\")","v":"Actuals"},{"$f":"IF(J6<='RFPR cover'!$C$7,\"Actuals\",\"Forecast\")","v":"Actuals"},{"$f":"IF(K6<='RFPR cover'!$C$7,\"Actuals\",\"Forecast\")","v":"Forecast"}]
[null,null,null,{"$f":"'RFPR cover'!$C$13","v":2014},{"$f":"D6+1","v":2015},2016,2017,2018,2019,2020,2021]
[]
[null,"Allowed Revenue - per latest submitted Revenue Return"]
[]
[null,"Opening Base Revenue Allowance",{"$f":"'RFPR cover'!$C$14","v":"£m 09/10"},353.1,346.4,368.5,358.9,354,353,347.6]
[null,"MOD",{"$f":"'RFPR cover'!$C$14","v":"£m 09/10"},0,-2.8,-1.7,-4.5,-20.7,-23.9,-26.6]
[null,"True Up",{"$f":"'RFPR cover'!$C$14","v":"£m 09/10"},0,0,1.20747556,-4.8563477000000006,-8.0213613000000006,-1.4067051699999999,0.88003088446052913]
[null,"Retail Price Index Forecast (RPIF term)","Index",1.1630163330372321,1.2050838144310987,1.2266528212575318,1.2327332873088215,1.270922538158505,1.314024254388422,1.358588447714592]
[null,"Nominal Base Revenue","£m nominal",{"$f":"SUM(D10:D12)*D13","v":410.66106719544666},414.06679863852548,451.41740813953618,430.89409555771067,413.40395310534728,430.5969374070761,437.3024915096442,0]
[null,"Incentive revenue adjustment","£m nominal",{"$f":"'R5 - Output Incentives'!D102","v":0.19089473000000001},{"$f":"'R5 - Output Incentives'!E102","v":0.17473432999999999},{"$f":"'R5 - Output Incentives'!F102","v":4.3033989699999999},{"$f":"'R5 - Output Incentives'!G102","v":4.0782259500000002},{"$f":"'R5 - Output Incentives'!H102","v":9.2044580799999984},{"$f":"'R5 - Output Incentives'!I102","v":7.4591298599999991},{"$f":"'R5 - Output Incentives'!J102","v":8.4045181599999985},{"$f":"'R5 - Output Incentives'!K102","v":9.9148036699999995}]
[null,"Adjustments for Allowed Pass-Through items","£m nominal",4.0796390000000002E-2,-9.5590369999999994E-2,-1.0682250000000001E-2,0.67515049999999999,2.6713019199999999,2.8650132199999998,24.672664417506425]
[null,"Network Innovation Allowance","£m nominal",{"$f":"'R6 - Innovation'!D12","v":0.53098115000000001},{"$f":"'R6 - Innovation'!E12","v":1.4330467600000001},{"$f":"'R6 - Innovation'!F12","v":1.7882452499999999},{"$f":"'R6 - Innovation'!G12","v":1.42875},{"$f":"'R6 - Innovation'!H12","v":1.37073668},{"$f":"'R6 - Innovation'!I12","v":0.90660788370000012},{"$f":"'R6 - Innovation'!J12","v":1.1337059797496605},{"$f":"'R6 - Innovation'!K12","v":1.3070839239888512}]
[null,"Low Carbon Networks Fund revenue adjustment","£m nominal",{"$f":"'R6 - Innovation'!D17","v":0},{"$f":"'R6 - Innovation'!E17","v":0},{"$f":"'R6 - Innovation'!F17","v":0},{"$f":"'R6 - Innovation'!G17","v":0},{"$f":"'R6 - Innovation'!H17","v":0},{"$f":"'R6 - Innovation'!I17","v":0},{"$f":"'R6 - Innovation'!J17","v":0},{"$f":"'R6 - Innovation'!K17","v":0}]
[null,"NTS Exit Capacity Cost Adjustment ","£m nominal",0,0,-1.6379653300000001,-0.71153425999999997,-2.0121201699999998,-2.6638200699999999,-2.5491045099999998]
[null,"Shrinkage Cost Adjustment ","£m nominal",0,0,-0.95363286999999997,-2.8081712200000002,-3.7098669599999998,-2.42619856,-1.95168217]
[null,"[Input description]","£m nominal",0,0,0,0,0,0,0]
[null,"[Input description]","£m nominal",0,0,0,0,0,0,0]
[null,"[Input description]","£m nominal",0,0,0,0,0,0,0]
[null,"[Input description]","£m nominal",0,0,0,0,0,0,0]
[null,"Correction factor","£m nominal",3.56448871,0,12.3764839,1.3113447600000001,3.4123873499999999,4.2993069799999999,1.3336070200000001]
[null,"Allowed Network Revenue","£m nominal",{"$f":"SUM(D14:D24,-D25)","v":407.85925075544674},415.57898935852546,442.53028800953621,432.24517176771059,417.51607530534727,432.43836276077616,465.67898636690029,11.22188759398885]
[]
[null,"(Under) / Over recovery",null,{"$f":"IF(ISBLANK(D33),0,D33-D26)","v":11.89588995455324},1.2604236414745174,3.2851524904638154,4.1450144022894051,1.2816092946527533,2.2746749192238553,2.5203384630996766,0]
[]
[]
[null,"Reconciliation: Regulated Network Revenue to Accounts"]
[]
[null,"Collected Regulated Network Revenue",null,419.75514070999998,416.83941299999998,445.81544050000002,436.39018616999999,418.79768460000003,434.71303768000001,468.19932482999997]
[]
[null,"Other Turnover Items"]
[null,"Network Innovation Competition (NIC) payments received from SO","£m nominal",0,0,0,0,0,0,0]
[null,"Legacy Metering Equipment charges","£m nominal",0,0,0,0,0,0,0]
[null,"Directly Remunerated Services revenue","£m nominal",0,0,0,0,0,0,0]
[null,"Network Asset Secondary Deliverables incentive/penalty","£m nominal",0,0,0,0,0,0,0]
[null,"Charging outside the Distribution Services Area (Out of Area Charges)","£m nominal",0,0,0,0,0,0,0]
[null,"De Minimis Business of the licensee","£m nominal",0.28912370531499015,1.0548908704166295,1.05059226426059,2.6342551622007799,2.2572086983078363,1.6411724093259759,1.4669898715839722]
[null,"Other consented activities","£m nominal",0,0,0,0,0,0,0]
[null,"Data Services revenue","£m nominal",0,0,0,0,0,0,0]
[null,"[Input description, add additional rows as required]","£m nominal",0,0,0,0,0,0,0]
[null,"Total Other Turnover Items","£m nominal",{"$f":"SUM(D36:D44)","v":0.28912370531499015},1.0548908704166295,1.05059226426059,2.6342551622007799,2.2572086983078363,1.6411724093259759,1.4669898715839722,0]
[]
[null,"Other adjustments - please list"]
[null,"Excluded Services (Inc. Customer Contributions)","£m nominal",4.8044793979736031,4.105497199162107,5.2458815146067437,5.3519220435328512,6.7507938108343852,6.9498605901679031,6.4580888286992657]
[null,"Meter Reading and metering","£m nominal",9.8714626536288517,8.9550815954326151,8.5574944193488012,5.7304400156680622,3.6888765277000006,3.4404841289000005,3.1423620318999999]
[null,"Services provided under consents","£m nominal",1.7883958647373104,2.1445130879978596,1.94549083932686,1.8229367997266559,0.75050676280556816,1.1778811887329936,1.1714245002736225]
[null,"Other transportation Revenue","£m nominal",0,0,0,5.0045683270000002E-2,-5.0045683270000002E-2,0.11658349578432117,9.0458670652073428E-2]
[null,"Customer contributions","£m nominal",-5.1710000000149137E-5,-1.0793070000000515E-2,0,0,0,0,0]
[null,"Xoserve","£m nominal",18.21307234,19.351176259999999,18.513168369999999,0,0,0,0]
[null,"Elimination of Inter Group/Business Trading","£m nominal",-45.707342586693898,-36.434556936893401,-27.357920700000001,0,0,0,0]
[null,"Revenue classified as expenditure","£m nominal",0,0,0,1.8391546184770959,0,0,0]
[null,"Other three network revenues","£m nominal",1460.6864312450371,1432.2080033830537,1456.9096731078396,1433.2962434117283,1419.6640971747984,1513.731333157089,1569.5325202739798]
[null,"Metering","£m nominal",321,309,300,0,0,0,0]
[null,"IFRS 15 Contribution released","£m nominal",0,0,0,0,0,32.985724249999997,63.189163970000003]
[null,"[Input description]","£m nominal",0,0,0,0,0,0,0]
[null,"[Input description]","£m nominal",0,0,0,0,0,0,0]
[null,"[Input description]","£m nominal",0,0,0,0,0,0,0]
[null,"[Input description]","£m nominal",0,0,0,0,0,0,0]
[null,"Roundings","£m nominal",0.25320213330814156,0.74396250112353368,0.2893431945123956,-0.14425490460375978,9.3369218921199593E-2,0.28799427999979299,1.749667022911126]
[null,"Total other adjustments","£m nominal",{"$f":"SUM(D48:D63)","v":1770.9096493379911},1740.0628840198765,1764.1031307456344,1447.9464876677991,1430.8975978117896,1558.689861090674,1645.333685298416,0]
[]
[null,"Reconciled total revenue","£m nominal",{"$f":"D33+D45+D64","v":2190.9539137533061},2157.957187890293,2210.9691635098952,1886.9709289999998,1851.9524911100975,1995.0440711799999,2115,0]
[null,"Turnover as per Profit and Loss (Accounts)","£m nominal",2191,2158,2211,1887,1852,1995,2115]
[null,"Check",null,{"$f":"IF(ABS(D66-D67)<'RFPR cover'!$F$14,\"OK\",\"Error\")","v":"OK"},{"$f":"IF(ABS(E66-E67)<'RFPR cover'!$F$14,\"OK\",\"Error\")","v":"OK"},{"$f":"IF(ABS(F66-F67)<'RFPR cover'!$F$14,\"OK\",\"Error\")","v":"OK"},{"$f":"IF(ABS(G66-G67)<'RFPR cover'!$F$14,\"OK\",\"Error\")","v":"OK"},{"$f":"IF(ABS(H66-H67)<'RFPR cover'!$F$14,\"OK\",\"Error\")","v":"OK"},{"$f":"IF(ABS(I66-I67)<'RFPR cover'!$F$14,\"OK\",\"Error\")","v":"OK"},{"$f":"IF(ABS(J66-J67)<'RFPR cover'!$F$14,\"OK\",\"Error\")","v":"OK"},{"$f":"IF(ABS(K66-K67)<'RFPR cover'!$F$14,\"OK\",\"Error\")","v":"OK"}]

{"sheet":"R3 - Rec to totex","index":6,"n_rows":93,"n_cols":11,"rows_kept":93,"cut":false,"hidden":false,"merged":[]}
["R3 - Reconciliation to totex"]
[{"$f":"'RFPR cover'!C5","v":"Cadent-London"}]
[{"$f":"'RFPR cover'!C7","v":2020}]
[]
[null,null,null,{"$f":"IF(D6<='RFPR cover'!$C$7,\"Actuals\",\"N/A\")","v":"Actuals"},{"$f":"IF(E6<='RFPR cover'!$C$7,\"Actuals\",\"N/A\")","v":"Actuals"},{"$f":"IF(F6<='RFPR cover'!$C$7,\"Actuals\",\"N/A\")","v":"Actuals"},{"$f":"IF(G6<='RFPR cover'!$C$7,\"Actuals\",\"N/A\")","v":"Actuals"},{"$f":"IF(H6<='RFPR cover'!$C$7,\"Actuals\",\"N/A\")","v":"Actuals"},{"$f":"IF(I6<='RFPR cover'!$C$7,\"Actuals\",\"N/A\")","v":"Actuals"},{"$f":"IF(J6<='RFPR cover'!$C$7,\"Actuals\",\"N/A\")","v":"Actuals"},{"$f":"IF(K6<='RFPR cover'!$C$7,\"Actuals\",\"N/A\")","v":"N/A"}]
[null,null,null,{"$f":"'RFPR cover'!$C$13","v":2014},{"$f":"D6+1","v":2015},2016,2017,2018,2019,2020,2021]
[]
[null,"Total Expenditure Per Accounts"]
[null,"Tangible Fixed Asset Additions","£m nominal",509,520,581,549,610,706,815]
[null,"Intangible Asset Additions (under IFRS) - IT Software","£m nominal",35,40,24,11,2,30,46]
[null,"Disposals (cash proceeds)\n[If Statutory Accounts treat this as an exceptional item, leave the input blank]","£m nominal",0,0,0,0,0,-2,-1]
[null,"Customer Contributions Additions","£m nominal",-21.088300859999997,-20.504847059999996,-22.986581709999996,-39.204288600000055,-59,-109,-94]
[null,"Capitalised interest","£m nominal",-2,-2,0,-1,0,0,0]
[null,"Revaluation of tangible fixed assets","£m nominal",0,0,0,0,0,0,0]
[1,"[Input description]","£m nominal",0,0,0,0,0,0,0]
[2,"[Input description]","£m nominal",0,0,0,0,0,0,0]
[3,"[Input description]","£m nominal",0,0,0,0,0,0,0]
[null,"Capex Incurred","£m nominal",{"$f":"SUM(D9:D17)","v":520.91169914},537.49515294000003,582.01341829,519.79571139999996,553,625,{"$f":"SUM(J9:J17)","v":766},0]
[null,"Operational Costs Incurred","£m nominal",1187,1153,1178,1129,1128,1182,1191]
[1,"[Input description]","£m nominal",0,0,0,0,0,0,0]
[2,"[Input description]","£m nominal",0,0,0,0,0,0,0]
[3,"[Input description]","£m nominal",0,0,0,0,0,0,0]
[null,"Total Expenditure Incurred","£m nominal",{"$f":"SUM(D18:D22)","v":1707.9116991400001},1690.49515294,1760.0134182900001,1648.7957114000001,1681,1807,1957,0]
[]
[null,"Reconciling Items to Total Net costs after non-price control allocations","£m nominal"]
[1,"Total expenditure relating to excluded services (deminimis, excluded, consented and meter reading)","£m nominal",-88.774791660000005,-86.6471708248,-66.48738516904001,-42.348235260000003,-33,-31.213308697214636,-29.412544884069913]
[2,"Depreciation & amortisation of Intangibles","£m nominal",-271,-287,-298,-309,-305,-319,-343]
[3,"Customer Contribution Amortisation","£m nominal",21.108361410441297,21.598685189999998,22.232259689999999,22.232259689999999,20.734517750000009,0,0]
[4,"Total expenditure relating to Metering business","£m nominal",-215,-199,-179,0,0,0,0]
[5,"Inter business unit charging elimination","£m nominal",45.707342586693883,36.434556936893372,27.357920700000001,0,0,0,0]
[6,"Profit / (Loss) on disposal","£m nominal",83,40,0,-11,0.45110357978542653,2,3]
[7,"Cadent Total GSOP Payments","£m nominal",-1.8029245628999997,-2.2699573819999999,-2.8711564699999998,-3.1122719167300001,-2.916930748,-3.3174192900000001,-5.0055712899999998]
[8,"Network Innovation Competition Costs","£m nominal",0,0,0,-3.5677410000000007E-2,-1.06975698,-0.72411406999999994,-0.99611845999999993]
[9,"Supplier of Last Resort (SoLR)","£m nominal",0,0,0,0,0,-3.1850938900000454,-3.1000725000000102]
[10,"Cash typical adjustments (provision movements)","£m nominal",-30,-1,0,-15,-1,-6,-39]
[11,"Atypical items - Separation expenditure (Opex)","£m nominal",0,0,0,-4.9190431599999727,-21.226457879999998,-17.529711290000002,-19]
[12,"Atypical items - Separation expenditure (Capex)","£m nominal",0,0,0,0,0,0,-5.9298542699999999]
[13,"Atypical Items - Grenfell investigation","£m nominal",0,0,0,0,-1.35563067,-1.0924227399999999,0.73110853000000009]
[14,"Atypical Items - Energy Savings Trust contributions","£m nominal",0,0,0,0,0,-8.9,0]
[15,"Atypical Items - HRB recovery programme costs","£m nominal",0,0,0,0,0,-3.6751768299999883,-8.3318929999999999E-2]
[16,"Atypical Items - Guaranteed minimum pensions payments","£m nominal",0,0,0,0,0,-14,0]
[17,"Atypical Items - Service transformation costs","£m nominal",0,0,0,0,0,-0.61276066000000007,0]
[18,"Atypical Items - Donation to National Energy Action ","£m nominal",0,0,-3,0,0,0,0]
[19,"Atypical items - Legal fines and penalties","£m nominal",0,0,-3,0,0,0,0]
[20,"Atypical Items - Enhanced GSOP payments","£m nominal",0,0,0,0,-1.33857,0,0]
[21,"Atypical Items - Establishment of a Community Fund","£m nominal",0,0,0,0,0,-4.1236280000000001,-5.6913419999999997]
[22,"IFRS 16 Impact","£m nominal",0,0,0,0,0,0,4.0331107200000034]
[23,"Total expenditure relating to other three networks","£m nominal",-950.36013402103026,-935.26077086173314,-956.801643129372,-959.77201820441837,-982.80591206377687,-1010.3167150289406,-1114.1772345806835]
[24,"Connections Income (including Biogas connections income)","£m nominal",-2.6452913719663038,-3.0523250029950963,-4.1960062449737077,-4.2558787006337022,-5.1194613041570634,-5.5341375773519639,-5.4126290673621362]
[25,"Ongoing Pension Costs Accrued under IAS 19 (-ve)","£m nominal",0.94950283778200006,0.15704675770662624,-0.33540464208954307,-1.8609624064083949,-1.9308649983305304,3.1170827670237604,8.1493811527235066E-4]
[26,"Incremental pension deficit funding","£m nominal",0,0,0,0,0.24778010468563902,0.26104188001550105,0.23979033525451793]
[27,"Established pension deficit recovery plan payment","£m nominal",0,0,0,0,7.9350947423272036,8.4316728030791257,7.0594129113262643]
[28,"A grossing up of costs and revenue in the regulatory accounts","£m nominal",0,0,0,-1.678600693014533,0,0,0]
[29,"Adjustment for efficient level of fines","£m nominal",-1.097390202571721,0,0,0,0,0,0]
[30,"Cash typical adjustments (Utilisation)","£m nominal",-4.1158587849691619,8.6904388889053337,4.9832696554747304,1.7386911435958436,1.1111675184507499,1.0539126079760823,5.1841604952603424]
[31,"Cumulative impact of rounding in reg accounts","£m nominal",-0.54556295078404027,0.61589926782197513,0.29895757340251383,-0.28388949899281796,-7.1882730609829082E-2,1.3829492710648901,1.3246513792176984]
[null,"Total Reconciling Items","£m nominal",{"$f":"SUM(D26:D56)","v":-1414.5767467193043},-1406.7335970302008,-1458.819188036598,-1329.2956264166019,-1326.3558036796251,-1412.9778287443476,-1549.2356366729414,0]
[]
[null,"Total Net costs after non-price control allocations","£m nominal",{"$f":"D57+D23","v":293.3349524206958},283.7615559097992,301.19423025340211,319.50008498339821,354.64419632037493,394.02217125565244,407.76436332705862,0]
[null,"Total Costs per latest RRP submission","£m nominal",293.33495242069557,283.76155590979909,301.19423025340217,319.47822668548173,354.64419632037453,394.02217125565227,407.76436332705862]
[null,null,"check",{"$f":"IF(D$5=\"Actuals\",IF(ABS(D59-D60)<1,\"OK\",\"ERROR\"),\"N/A\")","v":"OK"},"OK","OK","OK","OK","OK","OK","N/A"]
[null," "]
[null,"Reconciling Items to Totex"]
[1,"Shrinkage","£m nominal",5.5946936100000011,4.3466038900000008,3.0507138100000004,3.1650880179163967,3.6523899316536834,4.5683984549999996,2.2102063200000002]
[2,"Ofgem Licence","£m nominal",1.294,1.363936998,1.3900442208799999,1.1725999038709374,1.5102528,1.5706613279182753,1.7342873799999998]
[3,"Network Rates","£m nominal",27.704000000000001,28.349116956,28.994495933993399,29.270238000726071,51.889195245404672,53.240351799999999,42.323113999999997]
[4,"Established pension deficit recovery plan payment","£m nominal",1.6270736628400475,2.8439999999999999,2.8569859836340501,2.906427774311517,7.9132791803506546,8.4316728030791257,7.0594129113262643]
[5,"PPF levy costs","£m nominal",2.024045271172796E-2,0.16900000000000001,1.3068782597137301E-2,1.3967208699726735E-2,2.1815561976549415E-2,3.5272710776102736E-2,3.0481048576214403E-2]
[6,"Pension scheme administration costs","£m nominal",0.13915311239312975,0.14599999999999999,0.14620689009589202,0.14636269905233951,0.66133283523570641,0.76319469002511831,0.72458826214405347]
[7,"NTS Pension Recharge","£m nominal",4.3929999999999998,4.5792738480000006,6.4217686458100598,6.4551038762011173,4.140058561646879,4.2791639999999997,0]
[8,"Bad debt","£m nominal",-2.1320383527756656E-3,0.13464009700000001,-0.49735067199999999,0.24381375291281918,0.55995009953662056,2.3305134948805439E-2,-1.2943106204104554E-2]
[9,"NTS exit costs","£m nominal",18.632000000000001,19.707310328000002,18.88441018,18.735885399999997,19.517126009999998,15.786928380000001,17.228344180000001]
[10,"Network Innovation (ex IRM)","£m nominal",0.59299999999999997,1.7067747365881436,1.8366083560653201,1.5836535209693754,1.5198598273695607,1.0073420930000001,1.2596733108329561]
[11,"Innovation Roll-out expenditure (IRM)","£m nominal",0,0,0,0,0,0,0]
[12,"Unfunded Network Innovation","£m nominal",0,2.6789450000000003E-3,0,0.20397748521806044,0.14745610373277962,0.14110158095866535,0.28807898422837236]
[13,"SIU Gas Cost Price Differential","£m nominal",0,0,0,8.9822250000000001E-4,1.5525000000000001E-4,0,0]
[14,"[Input description]","£m nominal",0,0,0,0,0,0,0]
[15,"[Input description]","£m nominal",0,0,0,0,0,0,0]
[16,"[Input description]","£m nominal",0,0,0,0,0,0,0]
[17,"[Input description]","£m nominal",0,0,0,0,0,0,0]
[18,"[Input description]","£m nominal",0,0,0,0,0,0,0]
[19,"[Input description]","£m nominal",0,0,0,0,0,0,0]
[20,"[Input description]","£m nominal",0,0,0,0,0,0,0]
[21,"[Input description]","£m nominal",0,0,0,0,0,0,0]
[22,"[Input description]","£m nominal",0,0,0,0,0,0,0]
[23,"[Input description]","£m nominal",0,0,0,0,0,0,0]
[24,"[Input description]","£m nominal",0,0,0,0,0,0,0]
[25,"[Input description]","£m nominal",0,0,0,0,0,0,0]
[null,"Total reconciling items not recognised in totex","£m nominal",{"$f":"SUM(D64:D88)","v":59.995028799592134},63.349335798588143,63.096952131075845,63.898015862378358,91.53287140690712,89.847392975706086,72.845243290903753,0]
[]
[null,"PCFM Totex (excluding enduring value)","£m nominal",{"$f":"D59-D89","v":233.33992362110365},220.41222011121107,238.09727812232626,255.60206912101984,263.1113249134678,304.17477827994634,334.91912003615488,0]
[null,"RRP reported totex","£m nominal",{"$f":"'R4 - Totex'!D90+'R4 - Totex'!D118","v":233.34020502760728},{"$f":"'R4 - Totex'!E90+'R4 - Totex'!E118","v":220.38878061459548},{"$f":"'R4 - Totex'!F90+'R4 - Totex'!F118","v":238.09758662606336},{"$f":"'R4 - Totex'!G90+'R4 - Totex'!G118","v":255.60206912101978},{"$f":"'R4 - Totex'!H90+'R4 - Totex'!H118","v":263.11904948297268},{"$f":"'R4 - Totex'!I90+'R4 - Totex'!I118","v":304.17477827917958},{"$f":"'R4 - Totex'!J90+'R4 - Totex'!J118","v":334.91912004348859},{"$f":"'R4 - Totex'!K90+'R4 - Totex'!K118","v":419.01030979009442}]
[null,null,"check",{"$f":"IF(D$5=\"Actuals\",IF(ABS(D91-('R4 - Totex'!D90+'R4 - Totex'!D118))<'RFPR cover'!$F$14,\"OK\",\"Error\"),\"N/A\")","v":"OK"},{"$f":"IF(E$5=\"Actuals\",IF(ABS(E91-('R4 - Totex'!E90+'R4 - Totex'!E118))<'RFPR cover'!$F$14,\"OK\",\"Error\"),\"N/A\")","v":"OK"},{"$f":"IF(F$5=\"Actuals\",IF(ABS(F91-('R4 - Totex'!F90+'R4 - Totex'!F118))<'RFPR cover'!$F$14,\"OK\",\"Error\"),\"N/A\")","v":"OK"},{"$f":"IF(G$5=\"Actuals\",IF(ABS(G91-('R4 - Totex'!G90+'R4 - Totex'!G118))<'RFPR cover'!$F$14,\"OK\",\"Error\"),\"N/A\")","v":"OK"},{"$f":"IF(H$5=\"Actuals\",IF(ABS(H91-('R4 - Totex'!H90+'R4 - Totex'!H118))<'RFPR cover'!$F$14,\"OK\",\"Error\"),\"N/A\")","v":"OK"},{"$f":"IF(I$5=\"Actuals\",IF(ABS(I91-('R4 - Totex'!I90+'R4 - Totex'!I118))<'RFPR cover'!$F$14,\"OK\",\"Error\"),\"N/A\")","v":"OK"},{"$f":"IF(J$5=\"Actuals\",IF(ABS(J91-('R4 - Totex'!J90+'R4 - Totex'!J118))<'RFPR cover'!$F$14,\"OK\",\"Error\"),\"N/A\")","v":"OK"},{"$f":"IF(K$5=\"Actuals\",IF(ABS(K91-('R4 - Totex'!K90+'R4 - Totex'!K118))<'RFPR cover'!$F$14,\"OK\",\"Error\"),\"N/A\")","v":"N/A"}]

{"sheet":"R4 - Totex","index":7,"n_rows":149,"n_cols":14,"rows_kept":149,"cut":false,"hidden":false,"merged":[[13,14,13,16],[41,14,41,16],[91,14,91,16],[119,14,119,16]]}
["R4 - Totex"]
[{"$f":"'RFPR cover'!C5","v":"Cadent-London"}]
[{"$f":"'RFPR cover'!C7","v":2020}]
[]
[null,null,null,{"$f":"IF(D6<='RFPR cover'!$C$7,\"Actuals\",\"Forecast\")","v":"Actuals"},{"$f":"IF(E6<='RFPR cover'!$C$7,\"Actuals\",\"Forecast\")","v":"Actuals"},{"$f":"IF(F6<='RFPR cover'!$C$7,\"Actuals\",\"Forecast\")","v":"Actuals"},{"$f":"IF(G6<='RFPR cover'!$C$7,\"Actuals\",\"Forecast\")","v":"Actuals"},{"$f":"IF(H6<='RFPR cover'!$C$7,\"Actuals\",\"Forecast\")","v":"Actuals"},{"$f":"IF(I6<='RFPR cover'!$C$7,\"Actuals\",\"Forecast\")","v":"Actuals"},{"$f":"IF(J6<='RFPR cover'!$C$7,\"Actuals\",\"Forecast\")","v":"Actuals"},{"$f":"IF(K6<='RFPR cover'!$C$7,\"Actuals\",\"Forecast\")","v":"Forecast"}]
[null,null,null,{"$f":"'RFPR cover'!$C$13","v":2014},{"$f":"D6+1","v":2015},2016,2017,2018,2019,2020,2021,{"$f":"\"Cumulative to \"&'RFPR cover'!$C$7","v":"Cumulative to 2020"},"RIIO-1 period","Enduring Value Appendix in Commentary"]
[]
[null,"Totex per the latest RRP submission"]
[]
[null,{"$f":"Data!B48","v":"Totex excluding repex"}]
[]
[null,"Latest Totex actuals/forecast",{"$f":"'RFPR cover'!$C$14","v":"£m 09/10"},122.70470316384353,108.22463297650484,106.20313191167244,109.42697971811609,112.76025869935,114.57414570415708,121.8058411217667,128.29702004141083,{"$f":"SUM(D12:INDEX(D12:K12,0,MATCH('RFPR cover'!$C$7,$D$6:$K$6,0)))","v":795.69969329541061},{"$f":"SUM(D12:K12)","v":923.99671333682147}]
[null,"Totex allowance \n   including allowed adjustments and uncertainty mechanisms",{"$f":"'RFPR cover'!$C$14","v":"£m 09/10"},105.70138828811075,104.42407049502721,111.68346750980683,111.54334027727984,112.34907299915267,109.04757082331209,100.20569531853941,95.349335111970035,{"$f":"SUM(D13:INDEX(D13:K13,0,MATCH('RFPR cover'!$C$7,$D$6:$K$6,0)))","v":754.95460571122874},{"$f":"SUM(D13:K13)","v":850.30394082319879}]
[null,"Totex out(under)performance",{"$f":"'RFPR cover'!$C$14","v":"£m 09/10"},{"$f":"D13-D12","v":-17.003314875732784},-3.8005624814776269,5.4803355981343884,2.116360559163752,-0.41118570019733625,-5.5265748808449899,-21.600145803227292,-32.947684929440797,-40.745087584181874,-73.692772513622685]
[]
[null,"Funding Adjustment Rate (often referred to as 'sharing factor')","%",{"$f":"1-INDEX(Data!$D$73:$D$100,MATCH('RFPR cover'!$C$5,Data!$B$73:$B$100,0),0)","v":0.36960000000000004},{"$f":"1-INDEX(Data!$D$73:$D$100,MATCH('RFPR cover'!$C$5,Data!$B$73:$B$100,0),0)","v":0.36960000000000004},{"$f":"1-INDEX(Data!$D$73:$D$100,MATCH('RFPR cover'!$C$5,Data!$B$73:$B$100,0),0)","v":0.36960000000000004},{"$f":"1-INDEX(Data!$D$73:$D$100,MATCH('RFPR cover'!$C$5,Data!$B$73:$B$100,0),0)","v":0.36960000000000004},{"$f":"1-INDEX(Data!$D$73:$D$100,MATCH('RFPR cover'!$C$5,Data!$B$73:$B$100,0),0)","v":0.36960000000000004},{"$f":"1-INDEX(Data!$D$73:$D$100,MATCH('RFPR cover'!$C$5,Data!$B$73:$B$100,0),0)","v":0.36960000000000004},{"$f":"1-INDEX(Data!$D$73:$D$100,MATCH('RFPR cover'!$C$5,Data!$B$73:$B$100,0),0)","v":0.36960000000000004},{"$f":"1-INDEX(Data!$D$73:$D$100,MATCH('RFPR cover'!$C$5,Data!$B$73:$B$100,0),0)","v":0.36960000000000004}]
[]
[null,"Customer share of out(under) performance",{"$f":"'RFPR cover'!$C$14","v":"£m 09/10"},{"$f":"D14*D16","v":-6.2844251780708378},-1.4046878931541311,2.0255320370704704,0.78220686266692285,-0.15197423479293548,-2.0426220759603084,-7.9834138888728079,-12.177464349921319,{"$f":"SUM(D18:INDEX(D18:K18,0,MATCH('RFPR cover'!$C$7,$D$6:$K$6,0)))","v":-15.059384371113627},{"$f":"SUM(D18:K18)","v":-27.236848721034946}]
[null,"NWO share of performance",{"$f":"'RFPR cover'!$C$14","v":"£m 09/10"},{"$f":"D14*(1-D16)","v":-10.718889697661947},-2.3958745883234958,3.4548035610639181,1.3341536964968292,-0.25921146540440076,-3.4839528048846815,-13.616731914354483,-20.770220579519478,{"$f":"SUM(D19:INDEX(D19:K19,0,MATCH('RFPR cover'!$C$7,$D$6:$K$6,0)))","v":-25.685703213068262},{"$f":"SUM(D19:K19)","v":-46.45592379258774}]
[]
[null,"Enduring Value adjustments to Totex performance"]
["a","Gas Holders",{"$f":"'RFPR cover'!$C$14","v":"£m 09/10"},13.53712121212121,1.8643939393939393,-2.0265151515151514,-2.6749999999999998,-2.6749999999999998,-2.6749999999999998,-2.6749999999999998,-2.6749999999999998,{"$f":"SUM(D22:INDEX(D22:K22,0,MATCH('RFPR cover'!$C$7,$D$6:$K$6,0)))","v":2.6749999999999954},{"$f":"SUM(D22:K22)","v":-4.4408920985006262E-15}]
["b","Capex Enduring Value",{"$f":"'RFPR cover'!$C$14","v":"£m 09/10"},-6.3125836022814177,-6.8624369114774044,-11.239916301395123,-2.8759792043952901,-0.89260739202263228,-4.1006293301517625,10.218379882520615,22.065772859203012,{"$f":"SUM(D23:INDEX(D23:K23,0,MATCH('RFPR cover'!$C$7,$D$6:$K$6,0)))","v":-22.065772859203015},0]
["c","[Enduring Value adjustment]",{"$f":"'RFPR cover'!$C$14","v":"£m 09/10"},0,0,0,0,0,0,0,0,{"$f":"SUM(D24:INDEX(D24:K24,0,MATCH('RFPR cover'!$C$7,$D$6:$K$6,0)))","v":0},0]
["d","[Enduring Value adjustment]",{"$f":"'RFPR cover'!$C$14","v":"£m 09/10"},0,0,0,0,0,0,0,0,{"$f":"SUM(D25:INDEX(D25:K25,0,MATCH('RFPR cover'!$C$7,$D$6:$K$6,0)))","v":0},0]
["e","[Enduring Value adjustment]",{"$f":"'RFPR cover'!$C$14","v":"£m 09/10"},0,0,0,0,0,0,0,0,{"$f":"SUM(D26:INDEX(D26:K26,0,MATCH('RFPR cover'!$C$7,$D$6:$K$6,0)))","v":0},0]
["f","[Enduring Value adjustment]",{"$f":"'RFPR cover'!$C$14","v":"£m 09/10"},0,0,0,0,0,0,0,0,{"$f":"SUM(D27:INDEX(D27:K27,0,MATCH('RFPR cover'!$C$7,$D$6:$K$6,0)))","v":0},0]
[null,"Total enduring value adjustments",{"$f":"'RFPR cover'!$C$14","v":"£m 09/10"},{"$f":"SUM(D22:D27)","v":7.2245376098397927},-4.9980429720834652,-13.266431452910275,-5.5509792043952899,-3.5676073920226319,-6.7756293301517623,7.5433798825206155,19.390772859203011,{"$f":"SUM(D28:INDEX(D28:K28,0,MATCH('RFPR cover'!$C$7,$D$6:$K$6,0)))","v":-19.390772859203018},0]
[]
[null,"Enduring Value: Customer share of performance",{"$f":"'RFPR cover'!$C$14","v":"£m 09/10"},{"$f":"D28*D16","v":2.6701891005967875},-1.847276682482049,-4.9032730649956386,-2.0516419139444992,-1.3185876920915649,-2.5042726004240916,2.7880332045796199,7.1668296487614338,{"$f":"SUM(D30:INDEX(D30:K30,0,MATCH('RFPR cover'!$C$7,$D$6:$K$6,0)))","v":-7.1668296487614356},{"$f":"SUM(D30:K30)","v":0}]
[null,"Enduring Value: NWO share of performance",{"$f":"'RFPR cover'!$C$14","v":"£m 09/10"},{"$f":"D28*(1-D16)","v":4.5543485092430052},-3.1507662896014161,-8.3631583879146376,-3.4993372904507907,-2.249019699931067,-4.2713567297276711,4.7553466779409961,12.223943210441577,{"$f":"SUM(D31:INDEX(D31:K31,0,MATCH('RFPR cover'!$C$7,$D$6:$K$6,0)))","v":-12.223943210441583},{"$f":"SUM(D31:K31)","v":0}]
[]
[null,"Total out(under) performance (including enduring value adjustments)"]
[null,"Customer share of performance",{"$f":"'RFPR cover'!$C$14","v":"£m 09/10"},{"$f":"D18+D30","v":-3.6142360774740503},-3.2519645756361801,-2.8777410279251683,-1.2694350512775765,-1.4705619268845003,-4.5468946763844,-5.1953806842931876,-5.0106347011598853,{"$f":"SUM(D34:INDEX(D34:K34,0,MATCH('RFPR cover'!$C$7,$D$6:$K$6,0)))","v":-22.226214019875062},{"$f":"SUM(D34:K34)","v":-27.236848721034946}]
[null,"NWO share of performance",{"$f":"'RFPR cover'!$C$14","v":"£m 09/10"},-6.1645411884189416,-5.5466408779249115,-4.9083548268507196,-2.1651835939539614,-2.5082311653354679,-7.7553095346123531,-8.8613852364134864,-8.5462773690779006,{"$f":"SUM(D35:INDEX(D35:K35,0,MATCH('RFPR cover'!$C$7,$D$6:$K$6,0)))","v":-37.909646423509841},{"$f":"SUM(D35:K35)","v":-46.45592379258774}]
[null,"Total",{"$f":"'RFPR cover'!$C$14","v":"£m 09/10"},{"$f":"SUM(D34:D35)","v":-9.778777265892991},-8.7986054535610911,-7.7860958547758878,-3.4346186452315379,-3.9787930922199681,-12.302204210996752,-14.056765920706674,-13.556912070237786,{"$f":"SUM(D36:INDEX(D36:K36,0,MATCH('RFPR cover'!$C$7,$D$6:$K$6,0)))","v":-60.135860443384907},{"$f":"SUM(D36:K36)","v":-73.692772513622685}]
[]
[null,{"$f":"Data!B51","v":"Repex"}]
[]
[null,"Latest Totex actuals/forecast",{"$f":"'RFPR cover'!$C$14","v":"£m 09/10"},77.297346699272325,77.045097946712502,91.819486542979874,98.694366013208125,93.753949507732216,117.08496517504065,126.8316365119662,175.77448596111068,{"$f":"SUM(D40:INDEX(D40:K40,0,MATCH('RFPR cover'!$C$7,$D$6:$K$6,0)))","v":682.52684839691187},{"$f":"SUM(D40:K40)","v":858.30133435802259}]
[null,"Totex allowance \n   including allowed adjustments and uncertainty mechanisms",{"$f":"'RFPR cover'!$C$14","v":"£m 09/10"},130.5017484340967,132.65402347677067,140.00929643224401,133.80702305290794,128.33534914650531,124.16874703737606,131.26084647097292,132.85780316267454,{"$f":"SUM(D41:INDEX(D41:K41,0,MATCH('RFPR cover'!$C$7,$D$6:$K$6,0)))","v":920.73703405087372},{"$f":"SUM(D41:K41)","v":1053.5948372135483}]
[null,"Totex out(under)performance",{"$f":"'RFPR cover'!$C$14","v":"£m 09/10"},{"$f":"D41-D40","v":53.204401734824373},55.608925530058173,48.18980988926414,35.112657039699812,34.581399638773092,7.0837818623354138,4.4292099590067266,-42.916682798436142,238.21018565396184,195.29350285552573]
[]
[null,"Funding Adjustment Rate (often referred to as 'sharing factor')","%",{"$f":"1-INDEX(Data!$D$73:$D$100,MATCH('RFPR cover'!$C$5,Data!$B$73:$B$100,0),0)","v":0.36960000000000004},{"$f":"1-INDEX(Data!$D$73:$D$100,MATCH('RFPR cover'!$C$5,Data!$B$73:$B$100,0),0)","v":0.36960000000000004},{"$f":"1-INDEX(Data!$D$73:$D$100,MATCH('RFPR cover'!$C$5,Data!$B$73:$B$100,0),0)","v":0.36960000000000004},{"$f":"1-INDEX(Data!$D$73:$D$100,MATCH('RFPR cover'!$C$5,Data!$B$73:$B$100,0),0)","v":0.36960000000000004},{"$f":"1-INDEX(Data!$D$73:$D$100,MATCH('RFPR cover'!$C$5,Data!$B$73:$B$100,0),0)","v":0.36960000000000004},{"$f":"1-INDEX(Data!$D$73:$D$100,MATCH('RFPR cover'!$C$5,Data!$B$73:$B$100,0),0)","v":0.36960000000000004},{"$f":"1-INDEX(Data!$D$73:$D$100,MATCH('RFPR cover'!$C$5,Data!$B$73:$B$100,0),0)","v":0.36960000000000004},{"$f":"1-INDEX(Data!$D$73:$D$100,MATCH('RFPR cover'!$C$5,Data!$B$73:$B$100,0),0)","v":0.36960000000000004}]
[]
[null,"Customer share of out(under) performance",{"$f":"'RFPR cover'!$C$14","v":"£m 09/10"},{"$f":"D42*D44","v":19.66434688119109},20.553058875909503,17.81095373507203,12.977638041873051,12.781285306490537,2.6181657763191692,1.6370360008488865,-15.862005962302,{"$f":"SUM(D46:INDEX(D46:K46,0,MATCH('RFPR cover'!$C$7,$D$6:$K$6,0)))","v":88.042484617704261},{"$f":"SUM(D46:K46)","v":72.180478655402254}]
[null,"NWO share of performance",{"$f":"'RFPR cover'!$C$14","v":"£m 09/10"},{"$f":"D42*(1-D44)","v":33.540054853633279},35.055866654148673,30.37885615419211,22.135018997826759,21.800114332282558,4.4656160860162446,2.7921739581578402,-27.054676836134142,{"$f":"SUM(D47:INDEX(D47:K47,0,MATCH('RFPR cover'!$C$7,$D$6:$K$6,0)))","v":150.16770103625745},{"$f":"SUM(D47:K47)","v":123.11302420012331}]
[]
[null,"Enduring Value adjustments to Totex performance"]
["a","Repex Enduring Value",{"$f":"'RFPR cover'!$C$14","v":"£m 09/10"},-21.237782304384606,-13.431491522415641,-21.30178093030294,-4.60395761021043,-3.5069600738437239,7.9430058546280362,-2.7966455422410408,58.935612128770529,{"$f":"SUM(D50:INDEX(D50:K50,0,MATCH('RFPR cover'!$C$7,$D$6:$K$6,0)))","v":-58.935612128770352},{"$f":"SUM(D50:K50)","v":1.7763568394002505E-13}]
["b","[Enduring Value adjustment]",{"$f":"'RFPR cover'!$C$14","v":"£m 09/10"},0,0,0,0,0,0,0,0,{"$f":"SUM(D51:INDEX(D51:K51,0,MATCH('RFPR cover'!$C$7,$D$6:$K$6,0)))","v":0},0]
["c","[Enduring Value adjustment]",{"$f":"'RFPR cover'!$C$14","v":"£m 09/10"},0,0,0,0,0,0,0,0,{"$f":"SUM(D52:INDEX(D52:K52,0,MATCH('RFPR cover'!$C$7,$D$6:$K$6,0)))","v":0},0]
["d","[Enduring Value adjustment]",{"$f":"'RFPR cover'!$C$14","v":"£m 09/10"},0,0,0,0,0,0,0,0,{"$f":"SUM(D53:INDEX(D53:K53,0,MATCH('RFPR cover'!$C$7,$D$6:$K$6,0)))","v":0},0]
["e","[Enduring Value adjustment]",{"$f":"'RFPR cover'!$C$14","v":"£m 09/10"},0,0,0,0,0,0,0,0,{"$f":"SUM(D54:INDEX(D54:K54,0,MATCH('RFPR cover'!$C$7,$D$6:$K$6,0)))","v":0},0]
["f","[Enduring Value adjustment]",{"$f":"'RFPR cover'!$C$14","v":"£m 09/10"},0,0,0,0,0,0,0,0,{"$f":"SUM(D55:INDEX(D55:K55,0,MATCH('RFPR cover'!$C$7,$D$6:$K$6,0)))","v":0},0]
[null,"Total enduring value adjustments",{"$f":"'RFPR cover'!$C$14","v":"£m 09/10"},{"$f":"SUM(D50:D55)","v":-21.237782304384606},-13.431491522415641,-21.30178093030294,-4.60395761021043,-3.5069600738437239,7.9430058546280362,-2.7966455422410408,58.935612128770529,{"$f":"SUM(D56:INDEX(D56:K56,0,MATCH('RFPR cover'!$C$7,$D$6:$K$6,0)))","v":-58.935612128770352},1.7763568394002505E-13]
[]
[null,"Enduring Value: Customer share of performance",{"$f":"'RFPR cover'!$C$14","v":"£m 09/10"},{"$f":"D56*D44","v":-7.8494843397005507},-4.9642792666848212,-7.8731382318399676,-1.7016227327337752,-1.2961724432926405,2.9357349638705226,-1.0336401924122889,21.78260224279359,{"$f":"SUM(D58:INDEX(D58:K58,0,MATCH('RFPR cover'!$C$7,$D$6:$K$6,0)))","v":-21.782602242793519},{"$f":"SUM(D58:K58)","v":7.1054273576010019E-14}]
[null,"Enduring Value: NWO share of performance",{"$f":"'RFPR cover'!$C$14","v":"£m 09/10"},{"$f":"D56*(1-D44)","v":-13.388297964684055},-8.4672122557308196,-13.428642698462973,-2.9023348774766551,-2.2107876305510832,5.0072708907575141,-1.7630053498287519,37.153009885976942,{"$f":"SUM(D59:INDEX(D59:K59,0,MATCH('RFPR cover'!$C$7,$D$6:$K$6,0)))","v":-37.153009885976822},{"$f":"SUM(D59:K59)","v":1.2079226507921703E-13}]
[]
[null,"Total out(under) performance (including enduring value adjustments)"]
[null,"Customer share of performance",{"$f":"'RFPR cover'!$C$14","v":"£m 09/10"},{"$f":"D46+D58","v":11.814862541490539},15.588779609224682,9.9378155032320628,11.276015309139277,11.485112863197896,5.5539007401896914,0.60339580843659757,5.9205962804915906,{"$f":"SUM(D62:INDEX(D62:K62,0,MATCH('RFPR cover'!$C$7,$D$6:$K$6,0)))","v":66.259882374910759},{"$f":"SUM(D62:K62)","v":72.180478655402354}]
[null,"NWO share of performance",{"$f":"'RFPR cover'!$C$14","v":"£m 09/10"},20.151756888949222,26.588654398417852,16.950213455729138,19.232684120350104,19.589326701731473,9.4728869767737578,1.0291686083290883,10.0983330498428,{"$f":"SUM(D63:INDEX(D63:K63,0,MATCH('RFPR cover'!$C$7,$D$6:$K$6,0)))","v":113.01469115028064},{"$f":"SUM(D63:K63)","v":123.11302420012345}]
[null,"Total",{"$f":"'RFPR cover'!$C$14","v":"£m 09/10"},{"$f":"SUM(D62:D63)","v":31.966619430439764},42.177434007642532,26.8880289589612,30.508699429489383,31.074439564929371,15.026787716963449,1.6325644167656859,16.018929330334391,{"$f":"SUM(D64:INDEX(D64:K64,0,MATCH('RFPR cover'!$C$7,$D$6:$K$6,0)))","v":179.27457352519139},{"$f":"SUM(D64:K64)","v":195.29350285552579}]
[]
[null,"Totex Summary"]
[]
[null,"Total out(under) performance (including enduring value adjustments)"]
[null,"Customer share of performance",{"$f":"'RFPR cover'!$C$14","v":"£m 09/10"},{"$f":"D34+D62","v":8.200626464016489},12.336815033588502,7.0600744753068945,10.0065802578617,10.014550936313396,1.0070060638052913,-4.59198487585659,0.90996157933170529,{"$f":"SUM(D69:INDEX(D69:K69,0,MATCH('RFPR cover'!$C$7,$D$6:$K$6,0)))","v":44.033668355035687},{"$f":"SUM(D69:K69)","v":44.943629934367394}]
[null,"NWO share of performance",{"$f":"'RFPR cover'!$C$14","v":"£m 09/10"},13.987215700530282,21.04201352049294,12.041858628878419,17.067500526396142,17.081095536396006,1.7175774421614047,-7.8322166280843977,1.5520556807648997,{"$f":"SUM(D70:INDEX(D70:K70,0,MATCH('RFPR cover'!$C$7,$D$6:$K$6,0)))","v":75.105044726770799},{"$f":"SUM(D70:K70)","v":76.657100407535694}]
[null,"Total",{"$f":"'RFPR cover'!$C$14","v":"£m 09/10"},{"$f":"SUM(D69:D70)","v":22.187842164546772},33.378828554081444,19.101933104185314,27.074080784257841,27.095646472709404,2.7245835059666961,-12.424201503940989,2.462017260096605,{"$f":"SUM(D71:INDEX(D71:K71,0,MATCH('RFPR cover'!$C$7,$D$6:$K$6,0)))","v":119.13871308180651},{"$f":"SUM(D71:K71)","v":121.60073034190312}]
[]
[]
[null,"IQI Additional Income"]
[null,"Additional Income is Pre-tax for Fast Track companies and Post-tax for Slow Track."]
[]
[null,"IQI Additional Income per PCFM",{"$f":"'RFPR cover'!$C$14","v":"£m 09/10"},{"$f":"INDEX(Data!$C$119:$L$146,MATCH('RFPR cover'!$C$5,Data!$B$119:$B$146,0),MATCH('R4 - Totex'!D$6,Data!$C$118:$L$118,0))","v":1.2224510767557433},{"$f":"INDEX(Data!$C$119:$L$146,MATCH('RFPR cover'!$C$5,Data!$B$119:$B$146,0),MATCH('R4 - Totex'!E$6,Data!$C$118:$L$118,0))","v":1.2198157429394254},{"$f":"INDEX(Data!$C$119:$L$146,MATCH('RFPR cover'!$C$5,Data!$B$119:$B$146,0),MATCH('R4 - Totex'!F$6,Data!$C$118:$L$118,0))","v":1.2942164825881293},{"$f":"INDEX(Data!$C$119:$L$146,MATCH('RFPR cover'!$C$5,Data!$B$119:$B$146,0),MATCH('R4 - Totex'!G$6,Data!$C$118:$L$118,0))","v":1.2596396269108345},{"$f":"INDEX(Data!$C$119:$L$146,MATCH('RFPR cover'!$C$5,Data!$B$119:$B$146,0),MATCH('R4 - Totex'!H$6,Data!$C$118:$L$118,0))","v":1.2840112184368913},{"$f":"INDEX(Data!$C$119:$L$146,MATCH('RFPR cover'!$C$5,Data!$B$119:$B$146,0),MATCH('R4 - Totex'!I$6,Data!$C$118:$L$118,0))","v":1.2678511857965422},{"$f":"INDEX(Data!$C$119:$L$146,MATCH('RFPR cover'!$C$5,Data!$B$119:$B$146,0),MATCH('R4 - Totex'!J$6,Data!$C$118:$L$118,0))","v":1.2592019055105816},{"$f":"INDEX(Data!$C$119:$L$146,MATCH('RFPR cover'!$C$5,Data!$B$119:$B$146,0),MATCH('R4 - Totex'!K$6,Data!$C$118:$L$118,0))","v":1.257376658609527},{"$f":"SUM(D77:INDEX(D77:K77,0,MATCH('RFPR cover'!$C$7,$D$6:$K$6,0)))","v":8.8071872389381465},{"$f":"SUM(D77:K77)","v":10.064563897547673}]
[null,"Corporation tax rate when recognised in allowed revenue","%",{"$f":"IF(INDEX(Data!$J$73:$J$100,MATCH('RFPR cover'!$C$5,Data!$B$73:$B$100,0),0)=\"Pre\",INDEX(Data!$G$18:$G$27,MATCH('R4 - Totex'!D$6,Data!$C$18:$C$27,0),0),\"n/a\")","v":0.23},{"$f":"IF(INDEX(Data!$J$73:$J$100,MATCH('RFPR cover'!$C$5,Data!$B$73:$B$100,0),0)=\"Pre\",INDEX(Data!$G$18:$G$27,MATCH('R4 - Totex'!E$6,Data!$C$18:$C$27,0),0),\"n/a\")","v":0.21},{"$f":"IF(INDEX(Data!$J$73:$J$100,MATCH('RFPR cover'!$C$5,Data!$B$73:$B$100,0),0)=\"Pre\",INDEX(Data!$G$18:$G$27,MATCH('R4 - Totex'!F$6,Data!$C$18:$C$27,0),0),\"n/a\")","v":0.2},{"$f":"IF(INDEX(Data!$J$73:$J$100,MATCH('RFPR cover'!$C$5,Data!$B$73:$B$100,0),0)=\"Pre\",INDEX(Data!$G$18:$G$27,MATCH('R4 - Totex'!G$6,Data!$C$18:$C$27,0),0),\"n/a\")","v":0.2},{"$f":"IF(INDEX(Data!$J$73:$J$100,MATCH('RFPR cover'!$C$5,Data!$B$73:$B$100,0),0)=\"Pre\",INDEX(Data!$G$18:$G$27,MATCH('R4 - Totex'!H$6,Data!$C$18:$C$27,0),0),\"n/a\")","v":0.19},{"$f":"IF(INDEX(Data!$J$73:$J$100,MATCH('RFPR cover'!$C$5,Data!$B$73:$B$100,0),0)=\"Pre\",INDEX(Data!$G$18:$G$27,MATCH('R4 - Totex'!I$6,Data!$C$18:$C$27,0),0),\"n/a\")","v":0.19},{"$f":"IF(INDEX(Data!$J$73:$J$100,MATCH('RFPR cover'!$C$5,Data!$B$73:$B$100,0),0)=\"Pre\",INDEX(Data!$G$18:$G$27,MATCH('R4 - Totex'!J$6,Data!$C$18:$C$27,0),0),\"n/a\")","v":0.19},{"$f":"IF(INDEX(Data!$J$73:$J$100,MATCH('RFPR cover'!$C$5,Data!$B$73:$B$100,0),0)=\"Pre\",INDEX(Data!$G$18:$G$27,MATCH('R4 - Totex'!K$6,Data!$C$18:$C$27,0),0),\"n/a\")","v":0.19}]
[null,"Post tax",{"$f":"'RFPR cover'!$C$14","v":"£m 09/10"},{"$f":"IF(ISNUMBER(D78),D77*(1-D78),D77)","v":0.94128732910192237},0.96365443692214614,1.0353731860705035,1.0077117015286676,1.0400490869338821,1.0269594604951993,1.0199535434635711,1.018475093473717,{"$f":"SUM(D79:INDEX(D79:K79,0,MATCH('RFPR cover'!$C$7,$D$6:$K$6,0)))","v":7.0349887445158918},{"$f":"SUM(D79:K79)","v":8.0534638379896091}]
[]
[]
[]
[]
[null,"£m Nominal"]
[]
[null,{"$f":"Data!B34","v":"Financial Year Average RPI (RPIt)"},"Index",{"$f":"Data!C$34","v":1.1666890673736021},{"$f":"Data!D$34","v":1.1895563269638081},{"$f":"Data!E$34","v":1.2023757108362261},{"$f":"Data!F$34","v":1.2281396135646323},{"$f":"Data!G$34","v":1.2740965949380583},{"$f":"Data!H$34","v":1.3130274787154661},{"$f":"Data!I$34","v":1.3470178479563604},{"$f":"Data!J$34","v":1.3779992584593566}]
[]
[null,{"$f":"B10","v":"Totex excluding repex"}]
[]
[null,"Latest Totex actuals/forecast","£m nominal",{"$f":"D12*D$86","v":143.15823569657928},128.7392968905373,127.69606622533064,134.39160858455196,143.66746165317642,150.4390016599078,164.07464197635653,176.79319847960934,{"$f":"SUM(D90:INDEX(D90:K90,0,MATCH('RFPR cover'!$C$7,$D$6:$K$6,0)))","v":992.16631268643982},{"$f":"SUM(D90:K90)","v":1168.9595111660492}]
[null,"Totex allowance \n   including forecast allowed adjustments and uncertainty mechanisms","£m nominal",123.32065412195092,124.21831374467433,134.28548863575855,136.99079482384676,143.14357135266775,143.18245697817969,134.9788600609497,131.39131307888741,{"$f":"SUM(D91:INDEX(D91:K91,0,MATCH('RFPR cover'!$C$7,$D$6:$K$6,0)))","v":940.12013971802776},{"$f":"SUM(D91:K91)","v":1071.5114527969151}]
[null,"Totex out(under)performance","£m nominal",{"$f":"D91-D90","v":-19.837581574628359},-4.5209831458629708,6.5894224104279147,2.5991862392947951,-0.52389030050866836,-7.2565446817281156,-29.095781915406832,-45.401885400721937,-52.046172968412066,-97.44805836913406]
[]
[null,"Funding Adjustment Rate (often referred to as 'sharing factor')","%",{"$f":"1-INDEX(Data!$D$73:$D$100,MATCH('RFPR cover'!$C$5,Data!$B$73:$B$100,0),0)","v":0.36960000000000004},{"$f":"1-INDEX(Data!$D$73:$D$100,MATCH('RFPR cover'!$C$5,Data!$B$73:$B$100,0),0)","v":0.36960000000000004},{"$f":"1-INDEX(Data!$D$73:$D$100,MATCH('RFPR cover'!$C$5,Data!$B$73:$B$100,0),0)","v":0.36960000000000004},{"$f":"1-INDEX(Data!$D$73:$D$100,MATCH('RFPR cover'!$C$5,Data!$B$73:$B$100,0),0)","v":0.36960000000000004},{"$f":"1-INDEX(Data!$D$73:$D$100,MATCH('RFPR cover'!$C$5,Data!$B$73:$B$100,0),0)","v":0.36960000000000004},{"$f":"1-INDEX(Data!$D$73:$D$100,MATCH('RFPR cover'!$C$5,Data!$B$73:$B$100,0),0)","v":0.36960000000000004},{"$f":"1-INDEX(Data!$D$73:$D$100,MATCH('RFPR cover'!$C$5,Data!$B$73:$B$100,0),0)","v":0.36960000000000004},{"$f":"1-INDEX(Data!$D$73:$D$100,MATCH('RFPR cover'!$C$5,Data!$B$73:$B$100,0),0)","v":0.36960000000000004}]
[]
[null,"Customer share of out(under) performance","£m nominal",{"$f":"D92*D94","v":-7.3319701499826424},-1.6709553707109541,2.4354505228941576,0.9606592340433564,-0.19362985506800384,-2.6820189143667119,-10.753800995934366,-16.78053684410683,{"$f":"SUM(D96:INDEX(D96:K96,0,MATCH('RFPR cover'!$C$7,$D$6:$K$6,0)))","v":-19.236265529125163},{"$f":"SUM(D96:K96)","v":-36.016802373231997}]
[null,"NWO share of performance","£m nominal",{"$f":"D92*(1-D94)","v":-12.505611424645718},-2.8500277751520167,4.153971887533757,1.6385270052514387,-0.33026044544066452,-4.5745257673614041,-18.341980919472466,-28.621348556615107,{"$f":"SUM(D97:INDEX(D97:K97,0,MATCH('RFPR cover'!$C$7,$D$6:$K$6,0)))","v":-32.809907439287073},{"$f":"SUM(D97:K97)","v":-61.431255995902177}]
[]
[null,"Enduring Value adjustments to Totex performance"]
["a",{"$f":"B22","v":"Gas Holders"},"£m nominal",{"$f":"D22*D$86","v":15.793611321893101},2.2178016065590391,-2.4366325958234127,-3.2852734662853913,-3.4082083914593055,-3.5123485055638715,-3.6032727432832639,-3.6861480163787785,{"$f":"SUM(D100:INDEX(D100:K100,0,MATCH('RFPR cover'!$C$7,$D$6:$K$6,0)))","v":1.7656772260368934},{"$f":"SUM(D100:K100)","v":-1.9204707903418852}]
["b","Capex Enduring Value","£m nominal",-7.3648222756636006,-8.1632552464379202,-13.514602352629646,-3.5321039887059502,-1.1372680387925762,-5.3842389905158594,13.764340078953486,30.406618637314345,{"$f":"SUM(D101:INDEX(D101:K101,0,MATCH('RFPR cover'!$C$7,$D$6:$K$6,0)))","v":-25.331950813792069},5.074667823522276]
["c","[Enduring Value adjustment]","£m nominal",0,0,0,0,0,0,0,0,{"$f":"SUM(D102:INDEX(D102:K102,0,MATCH('RFPR cover'!$C$7,$D$6:$K$6,0)))","v":0},0]
["d","[Enduring Value adjustment]","£m nominal",0,0,0,0,0,0,0,0,{"$f":"SUM(D103:INDEX(D103:K103,0,MATCH('RFPR cover'!$C$7,$D$6:$K$6,0)))","v":0},0]
["e","[Enduring Value adjustment]","£m nominal",0,0,0,0,0,0,0,0,{"$f":"SUM(D104:INDEX(D104:K104,0,MATCH('RFPR cover'!$C$7,$D$6:$K$6,0)))","v":0},0]
["f","[Enduring Value adjustment]","£m nominal",0,0,0,0,0,0,0,0,{"$f":"SUM(D105:INDEX(D105:K105,0,MATCH('RFPR cover'!$C$7,$D$6:$K$6,0)))","v":0},0]
[null,"Total enduring value adjustments","£m nominal",{"$f":"SUM(D100:D105)","v":8.4287890462295003},-5.9454536398788811,-15.95123494845306,-6.8173774549913411,-4.545476430251882,-8.8965874960797304,10.161067335670221,26.720470620935565,{"$f":"SUM(D106:INDEX(D106:K106,0,MATCH('RFPR cover'!$C$7,$D$6:$K$6,0)))","v":-23.566273587755173},3.1541970331803917]
[]
[null,"Enduring Value: Customer share of performance","£m nominal",{"$f":"D106*D94","v":3.1152804314864238},-2.1974396652992345,-5.8955764369482511,-2.5197027073647997,-1.6800080886210957,-3.2881787385510686,3.7555304872637141,9.8758859414977866,{"$f":"SUM(D108:INDEX(D108:K108,0,MATCH('RFPR cover'!$C$7,$D$6:$K$6,0)))","v":-8.7100947180343109},{"$f":"SUM(D108:K108)","v":1.1657912234634757}]
[null,"Enduring Value: NWO share of performance","£m nominal",{"$f":"D106*(1-D94)","v":5.3135086147430766},-3.7480139745796466,-10.055658511504808,-4.2976747476265409,-2.8654683416307862,-5.6084087575286619,6.4055368484065074,16.84458467943778,{"$f":"SUM(D109:INDEX(D109:K109,0,MATCH('RFPR cover'!$C$7,$D$6:$K$6,0)))","v":-14.856178869720859},{"$f":"SUM(D109:K109)","v":1.9884058097169213}]
[]
[null,"Total out(under) performance (including enduring value adjustments)"]
[null,"Customer share of performance","£m nominal",{"$f":"D96+D108","v":-4.2166897184962187},-3.8683950360101886,-3.4601259140540934,-1.5590434733214433,-1.8736379436890995,-5.9701976529177809,-6.998270508670652,-6.9046509026090437,{"$f":"SUM(D112:INDEX(D112:K112,0,MATCH('RFPR cover'!$C$7,$D$6:$K$6,0)))","v":-27.946360247159475},{"$f":"SUM(D112:K112)","v":-34.851011149768517}]
[null,"NWO share of performance","£m nominal",-7.1921028099026412,-6.5980417497316637,-5.9016866239710506,-2.6591477423751022,-3.1957287870714506,-10.182934524890065,-11.936444071065958,-11.776763877177327,{"$f":"SUM(D113:INDEX(D113:K113,0,MATCH('RFPR cover'!$C$7,$D$6:$K$6,0)))","v":-47.66608630900793},{"$f":"SUM(D113:K113)","v":-59.442850186185254}]
[null,"Total","£m nominal",{"$f":"SUM(D112:D113)","v":-11.408792528398859},-10.466436785741852,-9.3618125380251449,-4.218191215696546,-5.0693667307605503,-16.153132177807848,-18.93471457973661,-18.681414779786373,{"$f":"SUM(D114:INDEX(D114:K114,0,MATCH('RFPR cover'!$C$7,$D$6:$K$6,0)))","v":-75.612446556167413},{"$f":"SUM(D114:K114)","v":-94.293861335953778}]
[]
[null,{"$f":"B38","v":"Repex"}]
[]
[null,"Latest Totex actuals/forecast","£m nominal",{"$f":"D40*D$86","v":90.181969331028014},91.649483724058157,110.40152040073272,121.21046053646781,119.45158782979627,153.73577661927177,170.84447806713206,242.21711131048511,{"$f":"SUM(D118:INDEX(D118:K118,0,MATCH('RFPR cover'!$C$7,$D$6:$K$6,0)))","v":857.47527650848679},{"$f":"SUM(D118:K118)","v":1099.6923878189718}]
[null,"Totex allowance \n   including forecast allowed adjustments and uncertainty mechanisms","£m nominal",152.25496317120073,157.7994329239981,168.3437773213993,164.33370558443221,163.51163135774925,163.03697685774441,176.81070293426018,183.07795423870468,{"$f":"SUM(D119:INDEX(D119:K119,0,MATCH('RFPR cover'!$C$7,$D$6:$K$6,0)))","v":1146.0911901507843},{"$f":"SUM(D119:K119)","v":1329.169144389489}]
[null,"Totex out(under)performance","£m nominal",{"$f":"D119-D118","v":62.072993840172714},66.14994919993994,57.94225692066658,43.123245047964403,44.060043527952985,9.3012002384726316,5.9662248671281191,-59.139157071780431,288.61591364229753,229.47675657051718]
[]
[null,"Funding Adjustment Rate (often referred to as 'sharing factor')","%",{"$f":"1-INDEX(Data!$D$73:$D$100,MATCH('RFPR cover'!$C$5,Data!$B$73:$B$100,0),0)","v":0.36960000000000004},{"$f":"1-INDEX(Data!$D$73:$D$100,MATCH('RFPR cover'!$C$5,Data!$B$73:$B$100,0),0)","v":0.36960000000000004},{"$f":"1-INDEX(Data!$D$73:$D$100,MATCH('RFPR cover'!$C$5,Data!$B$73:$B$100,0),0)","v":0.36960000000000004},{"$f":"1-INDEX(Data!$D$73:$D$100,MATCH('RFPR cover'!$C$5,Data!$B$73:$B$100,0),0)","v":0.36960000000000004},{"$f":"1-INDEX(Data!$D$73:$D$100,MATCH('RFPR cover'!$C$5,Data!$B$73:$B$100,0),0)","v":0.36960000000000004},{"$f":"1-INDEX(Data!$D$73:$D$100,MATCH('RFPR cover'!$C$5,Data!$B$73:$B$100,0),0)","v":0.36960000000000004},{"$f":"1-INDEX(Data!$D$73:$D$100,MATCH('RFPR cover'!$C$5,Data!$B$73:$B$100,0),0)","v":0.36960000000000004},{"$f":"1-INDEX(Data!$D$73:$D$100,MATCH('RFPR cover'!$C$5,Data!$B$73:$B$100,0),0)","v":0.36960000000000004}]
[]
[null,"Customer share of out(under) performance","£m nominal",{"$f":"D120*D122","v":22.942178523327836},24.449021224297805,21.415458157878369,15.938351369727645,16.284592087931426,3.4377236081394851,2.2051167108905529,-21.857832453730051,{"$f":"SUM(D124:INDEX(D124:K124,0,MATCH('RFPR cover'!$C$7,$D$6:$K$6,0)))","v":106.67244168219311},{"$f":"SUM(D124:K124)","v":84.814609228463056}]
[null,"NO share of performance","£m nominal",{"$f":"D120*(1-D122)","v":39.130815316844874},41.700927975642138,36.526798762788211,27.184893678236758,27.775451440021559,5.8634766303331469,3.7611081562375661,-37.281324618050384,{"$f":"SUM(D125:INDEX(D125:K125,0,MATCH('RFPR cover'!$C$7,$D$6:$K$6,0)))","v":181.94347196010423},{"$f":"SUM(D125:K125)","v":144.66214734205386}]
[]
[null,"Enduring Value adjustments to Totex performance"]
["a",{"$f":"B50","v":"Repex Enduring Value"},"£m nominal",{"$f":"D50*D$86","v":-24.777888429786067},-15.977515721050276,-25.612743988150562,-5.6543027202717857,-4.4682058886680096,10.429384950724437,-3.7671314598062753,81.213229810294052,{"$f":"SUM(D128:INDEX(D128:K128,0,MATCH('RFPR cover'!$C$7,$D$6:$K$6,0)))","v":-69.828403257008532},{"$f":"SUM(D128:K128)","v":11.384826553285521}]
["b","[Enduring Value adjustment]","£m nominal",0,0,0,0,0,0,0,0,{"$f":"SUM(D129:INDEX(D129:K129,0,MATCH('RFPR cover'!$C$7,$D$6:$K$6,0)))","v":0},0]
["c","[Enduring Value adjustment]","£m nominal",0,0,0,0,0,0,0,0,{"$f":"SUM(D130:INDEX(D130:K130,0,MATCH('RFPR cover'!$C$7,$D$6:$K$6,0)))","v":0},0]
["d","[Enduring Value adjustment]","£m nominal",0,0,0,0,0,0,0,0,{"$f":"SUM(D131:INDEX(D131:K131,0,MATCH('RFPR cover'!$C$7,$D$6:$K$6,0)))","v":0},0]
["e","[Enduring Value adjustment]","£m nominal",0,0,0,0,0,0,0,0,{"$f":"SUM(D132:INDEX(D132:K132,0,MATCH('RFPR cover'!$C$7,$D$6:$K$6,0)))","v":0},0]
["f","[Enduring Value adjustment]","£m nominal",0,0,0,0,0,0,0,0,{"$f":"SUM(D133:INDEX(D133:K133,0,MATCH('RFPR cover'!$C$7,$D$6:$K$6,0)))","v":0},0]
[null,"Total enduring value adjustments","£m nominal",{"$f":"SUM(D128:D133)","v":-24.777888429786067},-15.977515721050276,-25.612743988150562,-5.6543027202717857,-4.4682058886680096,10.429384950724437,-3.7671314598062753,81.213229810294052,{"$f":"SUM(D134:INDEX(D134:K134,0,MATCH('RFPR cover'!$C$7,$D$6:$K$6,0)))","v":-69.828403257008532},11.384826553285521]
[]
[null,"Enduring Value: Customer share of performance","£m nominal",{"$f":"D134*D122","v":-9.1579075636489318},-5.9052898105001823,-9.4664701780204492,-2.0898302854124524,-1.6514488964516965,3.8547006777877524,-1.3923317875443995,30.016409737884686,{"$f":"SUM(D136:INDEX(D136:K136,0,MATCH('RFPR cover'!$C$7,$D$6:$K$6,0)))","v":-25.80857784379036},{"$f":"SUM(D136:K136)","v":4.2078318940943262}]
[null,"Enduring Value: NWO share of performance","£m nominal",{"$f":"D134*(1-D122)","v":-15.619980866137135},-10.072225910550094,-16.146273810130115,-3.5644724348593333,-2.8167569922163129,6.5746842729366843,-2.3747996722618758,51.196820072409366,{"$f":"SUM(D137:INDEX(D137:K137,0,MATCH('RFPR cover'!$C$7,$D$6:$K$6,0)))","v":-44.019825413218172},{"$f":"SUM(D137:K137)","v":7.1769946591911946}]
[]
[null,"Total out(under) performance (including enduring value adjustments)"]
[null,"Customer share of performance","£m nominal",{"$f":"D124+D136","v":13.784270959678905},18.543731413797623,11.94898797985792,13.848521084315193,14.633143191479729,7.2924242859272379,0.81278492334615349,8.1585772841546351,{"$f":"SUM(D140:INDEX(D140:K140,0,MATCH('RFPR cover'!$C$7,$D$6:$K$6,0)))","v":80.863863838402764},{"$f":"SUM(D140:K140)","v":89.022441122557396}]
[null,"NWO share of performance","£m nominal",23.51083445070774,31.628702065092043,20.380524952658096,23.620421243377425,24.958694447805247,12.438160903269832,1.3863084839756903,13.915495454358982,{"$f":"SUM(D141:INDEX(D141:K141,0,MATCH('RFPR cover'!$C$7,$D$6:$K$6,0)))","v":137.92364654688606},{"$f":"SUM(D141:K141)","v":151.83914200124505}]
[null,"Total","£m nominal",{"$f":"SUM(D140:D141)","v":37.295105410386647},50.172433478889666,32.329512932516018,37.468942327692616,39.591837639284975,19.730585189197072,2.1990934073218438,22.074072738513618,{"$f":"SUM(D142:INDEX(D142:K142,0,MATCH('RFPR cover'!$C$7,$D$6:$K$6,0)))","v":218.78751038528887},{"$f":"SUM(D142:K142)","v":240.86158312380249}]
[]
[null,"Totex Summary"]
[]
[null,"Total out(under) performance (including enduring value adjustments)"]
[null,"Customer share of performance","£m nominal",{"$f":"D112+D140","v":9.5675812411826868},14.675336377787435,8.4888620658038256,12.28947761099375,12.75950524779063,1.322226633009457,-6.1854855853244981,1.2539263815455914,{"$f":"SUM(D147:INDEX(D147:K147,0,MATCH('RFPR cover'!$C$7,$D$6:$K$6,0)))","v":52.917503591243282},{"$f":"SUM(D147:K147)","v":54.171429972788872}]
[null,"NWO share of performance","£m nominal",16.318731640805098,25.030660315360379,14.478838328687045,20.961273501002324,21.762965660733798,2.255226378379767,-10.550135587090267,2.1387315771816553,{"$f":"SUM(D148:INDEX(D148:K148,0,MATCH('RFPR cover'!$C$7,$D$6:$K$6,0)))","v":90.257560237878153},{"$f":"SUM(D148:K148)","v":92.396291815059811}]
[null,"Total","£m nominal",{"$f":"SUM(D147:D148)","v":25.886312881987784},39.70599669314781,22.967700394490869,33.250751111996074,34.522470908524426,3.577453011389224,-16.735621172414767,3.3926579587272467,{"$f":"SUM(D149:INDEX(D149:K149,0,MATCH('RFPR cover'!$C$7,$D$6:$K$6,0)))","v":143.1750638291214},{"$f":"SUM(D149:K149)","v":146.56772178784865}]

{"sheet":"R5 - Output Incentives","index":8,"n_rows":111,"n_cols":13,"rows_kept":111,"cut":false,"hidden":false,"merged":[[110,1,110,12],[20,1,20,12],[21,1,21,12],[22,1,22,12],[23,1,23,12],[24,1,24,12],[104,1,104,12],[105,1,105,12],[106,1,106,12],[107,1,107,12],[108,1,108,12],[109,1,109,12]]}
["R5 - Output Incentives"]
[{"$f":"'RFPR cover'!C5","v":"Cadent-London"}]
[{"$f":"'RFPR cover'!C7","v":2020}]
[]
[null,null,null,{"$f":"IF(D6<='RFPR cover'!$C$7,\"Actuals\",\"Forecast\")","v":"Actuals"},{"$f":"IF(E6<='RFPR cover'!$C$7,\"Actuals\",\"Forecast\")","v":"Actuals"},{"$f":"IF(F6<='RFPR cover'!$C$7,\"Actuals\",\"Forecast\")","v":"Actuals"},{"$f":"IF(G6<='RFPR cover'!$C$7,\"Actuals\",\"Forecast\")","v":"Actuals"},{"$f":"IF(H6<='RFPR cover'!$C$7,\"Actuals\",\"Forecast\")","v":"Actuals"},{"$f":"IF(I6<='RFPR cover'!$C$7,\"Actuals\",\"Forecast\")","v":"Actuals"},{"$f":"IF(J6<='RFPR cover'!$C$7,\"Actuals\",\"Forecast\")","v":"Actuals"},{"$f":"IF(K6<='RFPR cover'!$C$7,\"Actuals\",\"Forecast\")","v":"Forecast"}]
[null,null,null,{"$f":"'RFPR cover'!$C$13","v":2014},{"$f":"D6+1","v":2015},2016,2017,2018,2019,2020,2021,{"$f":"\"Cumulative to \"&'RFPR cover'!$C$7","v":"Cumulative to 2020"},"RIIO-1 period"]
[]
[null,"Pre-tax Earned Incentives (Actuals may be updated once all incentives are determined)"]
[null,"These values exclude any inflation, interest or time value of money adjustments"]
[]
["a",{"$f":"Data!B153","v":"Broad Measure of Customer Satisfaction "},{"$f":"'RFPR cover'!$C$14","v":"£m 09/10"},0.43464864743644055,8.4127655912987001E-2,0.95608173606963875,0.90385963385263635,0.87293225461093071,1.1070474744042118,1.6542637475287436,2.2587619959015801,{"$f":"SUM(D11:INDEX(D11:K11,0,MATCH('RFPR cover'!$C$7,$D$6:$K$6,0)))","v":6.0129611498155882},{"$f":"SUM(D11:K11)","v":8.2717231457171678}]
["b",{"$f":"Data!B154","v":"Shrinkage Allowance Revenue Adjustment"},{"$f":"'RFPR cover'!$C$14","v":"£m 09/10"},0.49563233868776463,0.34557911170909084,0.24925849650905818,0.20747448747822247,0.32642748190851484,0.58006104943495007,0.32680976385354238,0.22344513523576701,{"$f":"SUM(D12:INDEX(D12:K12,0,MATCH('RFPR cover'!$C$7,$D$6:$K$6,0)))","v":2.5312427295811437},2.7546878648169106]
["c",{"$f":"Data!B155","v":"Environment Emissions Incentive "},{"$f":"'RFPR cover'!$C$14","v":"£m 09/10"},1.5602225035063555,1.5202694599740256,1.4157235028922008,1.2494933333878417,1.7108423318318222,2.4632066735358995,2.8319536950276687,3.6116749607424685,{"$f":"SUM(D13:INDEX(D13:K13,0,MATCH('RFPR cover'!$C$7,$D$6:$K$6,0)))","v":12.751711500155814},16.363386460898283]
["d",{"$f":"Data!B156","v":"Discretionary Reward Scheme"},{"$f":"'RFPR cover'!$C$14","v":"£m 09/10"},4.6586892848831704E-2,4.6586892848831704E-2,2.9574163065161849E-2,2.9574163065161849E-2,2.9574163065161849E-2,0,0,0,{"$f":"SUM(D14:INDEX(D14:K14,0,MATCH('RFPR cover'!$C$7,$D$6:$K$6,0)))","v":0.18189627489314897},0.18189627489314897]
["e",{"$f":"Data!B157","v":"NTS Exit Capacity"},{"$f":"'RFPR cover'!$C$14","v":"£m 09/10"},1.11748015,1.2525667600000001,4.4257972199999998,3.2337239599999998,3.13358779,3.0760632499999998,2.42951066,1.80982226,{"$f":"SUM(D15:INDEX(D15:K15,0,MATCH('RFPR cover'!$C$7,$D$6:$K$6,0)))","v":18.66872979},20.478552050000001]
["f",{"$f":"Data!B158","v":""},{"$f":"'RFPR cover'!$C$14","v":"£m 09/10"},0,0,0,0,0,0,0,0,{"$f":"SUM(D16:INDEX(D16:K16,0,MATCH('RFPR cover'!$C$7,$D$6:$K$6,0)))","v":0},0]
["g",{"$f":"Data!B159","v":""},{"$f":"'RFPR cover'!$C$14","v":"£m 09/10"},0,0,0,0,0,0,0,0,{"$f":"SUM(D17:INDEX(D17:K17,0,MATCH('RFPR cover'!$C$7,$D$6:$K$6,0)))","v":0},0]
[null,"Earned Incentive revenue",{"$f":"'RFPR cover'!$C$14","v":"£m 09/10"},{"$f":"SUM(D11:D17)","v":3.6545705324793922},3.2491298804449356,7.0764351185360592,5.6241255777838628,6.0733640214164293,7.226378447375061,7.2425378664099549,7.9037043518798153,40.146541444445695,48.050245796325513]
[]
[null,"Additional Commentary"]
[{"$f":"A11","v":"a"}]
[{"$f":"A12","v":"b"}]
[{"$f":"A13","v":"c"}]
[{"$f":"A14","v":"d"}]
[{"$f":"A15","v":"e"}]
["f"]
["g"]
[]
[]
[null,"Post-tax Earned Incentives (Actuals may be updated once all incentives are determined)"]
[]
[null,"Year tax paid when incentive recognised in allowed revenue. Select from dropdown in Column C"]
[null,"-"]
[null,"t+0"]
[null,"t+1"]
[null,"t+2"]
[null,"t+3"]
[]
[{"$f":"A11","v":"a"},{"$f":"$B$11&\"\"","v":"Broad Measure of Customer Satisfaction "},{"$f":"'RFPR cover'!$C$14","v":"£m 09/10"},{"$f":"D51","v":0.34771891794915244},6.7302124730389601E-2,0.77442620621640745,0.73212630342063545,0.70707512623485391,0.89670845426741164,1.3399536354982824,1.8295972166802801,{"$f":"SUM(D39:INDEX(D39:K39,0,MATCH('RFPR cover'!$C$7,$D$6:$K$6,0)))","v":4.8653107683171326},{"$f":"SUM(D39:K39)","v":6.6949079849974122}]
["b",{"$f":"$B$12&\"\"","v":"Shrinkage Allowance Revenue Adjustment"},{"$f":"'RFPR cover'!$C$14","v":"£m 09/10"},{"$f":"D55","v":0.39650587095021173},0.27646328936727266,0.20189938217233713,0.16805433485736021,0.26440626034589704,0.4698494500423096,0.26471590872136935,0.18099055954097129,{"$f":"SUM(D40:INDEX(D40:K40,0,MATCH('RFPR cover'!$C$7,$D$6:$K$6,0)))","v":2.0418944964567576},2.2228850559977289]
["c",{"$f":"$B$13&\"\"","v":"Environment Emissions Incentive "},{"$f":"'RFPR cover'!$C$14","v":"£m 09/10"},{"$f":"D59","v":1.2481780028050844},1.2162155679792206,1.1467360373426827,1.0120896000441519,1.3857822887837761,1.9951974055640787,2.2938824929724118,2.9254567182013997,{"$f":"SUM(D41:INDEX(D41:K41,0,MATCH('RFPR cover'!$C$7,$D$6:$K$6,0)))","v":10.298081395491407},13.223538113692806]
["d",{"$f":"$B$14&\"\"","v":"Discretionary Reward Scheme"},{"$f":"'RFPR cover'!$C$14","v":"£m 09/10"},{"$f":"D63","v":3.7269514279065365E-2},3.7269514279065365E-2,2.3955072082781099E-2,2.3955072082781099E-2,2.3955072082781099E-2,0,0,0,{"$f":"SUM(D42:INDEX(D42:K42,0,MATCH('RFPR cover'!$C$7,$D$6:$K$6,0)))","v":0.14640424480647402},0.14640424480647402]
["e",{"$f":"$B$15&\"\"","v":"NTS Exit Capacity"},{"$f":"'RFPR cover'!$C$14","v":"£m 09/10"},{"$f":"D67","v":0.89398412000000005},1.0020534080000001,3.5848957482000001,2.6193164076,2.5382061099,2.4916112324999999,1.9679036346000001,1.4659560306000001,{"$f":"SUM(D43:INDEX(D43:K43,0,MATCH('RFPR cover'!$C$7,$D$6:$K$6,0)))","v":15.097970660800001},16.563926691400003]
["f",{"$f":"$B$16&\"\"","v":""},{"$f":"'RFPR cover'!$C$14","v":"£m 09/10"},{"$f":"D71","v":0},0,0,0,0,0,0,0,{"$f":"SUM(D44:INDEX(D44:K44,0,MATCH('RFPR cover'!$C$7,$D$6:$K$6,0)))","v":0},0]
["g",{"$f":"$B$17&\"\"","v":""},{"$f":"'RFPR cover'!$C$14","v":"£m 09/10"},{"$f":"D75","v":0},0,0,0,0,0,0,0,{"$f":"SUM(D45:INDEX(D45:K45,0,MATCH('RFPR cover'!$C$7,$D$6:$K$6,0)))","v":0},0]
[null,"Post-Tax Earned Incentive revenue",{"$f":"'RFPR cover'!$C$14","v":"£m 09/10"},{"$f":"SUM(D39:D45)","v":2.9236564259835136},2.5993039043559483,5.7319124460142081,4.5555417180049282,4.9194248573473081,5.8533665423738004,5.8664556717920631,6.4020005250226513,32.449661565871772,38.851662090894422]
[]
[]
[{"$f":"$A$11","v":"a"},{"$f":"INDEX($B$11:$B$15,MATCH($A49,$A$11:$A$15,0),0)&\"\"","v":"Broad Measure of Customer Satisfaction "},{"$f":"'RFPR cover'!$C$14","v":"£m 09/10"},{"$f":"INDEX($D$11:$K$17,MATCH($A49,$A$11:$A$17,0),0)","v":0.43464864743644055},8.4127655912987001E-2,0.95608173606963875,0.90385963385263635,0.87293225461093071,1.1070474744042118,1.6542637475287436,2.2587619959015801,{"$f":"SUM(D49:INDEX(D49:K49,0,MATCH('RFPR cover'!$C$7,$D$6:$K$6,0)))","v":6.0129611498155882},{"$f":"SUM(D49:K49)","v":8.2717231457171678}]
[null,"Corporation tax rate when recognised in allowed revenue","t+2",{"$f":"IF($C50=$B$33,$B$33,INDEX(Data!$G$14:$G$30,MATCH('R5 - Output Incentives'!D$6+RIGHT('R5 - Output Incentives'!$C50,2),Data!$C$14:$C$30,0),0))","v":0.2},{"$f":"IF($C50=$B$33,$B$33,INDEX(Data!$G$14:$G$30,MATCH('R5 - Output Incentives'!E$6+RIGHT('R5 - Output Incentives'!$C50,2),Data!$C$14:$C$30,0),0))","v":0.2},{"$f":"IF($C50=$B$33,$B$33,INDEX(Data!$G$14:$G$30,MATCH('R5 - Output Incentives'!F$6+RIGHT('R5 - Output Incentives'!$C50,2),Data!$C$14:$C$30,0),0))","v":0.19},{"$f":"IF($C50=$B$33,$B$33,INDEX(Data!$G$14:$G$30,MATCH('R5 - Output Incentives'!G$6+RIGHT('R5 - Output Incentives'!$C50,2),Data!$C$14:$C$30,0),0))","v":0.19},{"$f":"IF($C50=$B$33,$B$33,INDEX(Data!$G$14:$G$30,MATCH('R5 - Output Incentives'!H$6+RIGHT('R5 - Output Incentives'!$C50,2),Data!$C$14:$C$30,0),0))","v":0.19},{"$f":"IF($C50=$B$33,$B$33,INDEX(Data!$G$14:$G$30,MATCH('R5 - Output Incentives'!I$6+RIGHT('R5 - Output Incentives'!$C50,2),Data!$C$14:$C$30,0),0))","v":0.19},{"$f":"IF($C50=$B$33,$B$33,INDEX(Data!$G$14:$G$30,MATCH('R5 - Output Incentives'!J$6+RIGHT('R5 - Output Incentives'!$C50,2),Data!$C$14:$C$30,0),0))","v":0.19},{"$f":"IF($C50=$B$33,$B$33,INDEX(Data!$G$14:$G$30,MATCH('R5 - Output Incentives'!K$6+RIGHT('R5 - Output Incentives'!$C50,2),Data!$C$14:$C$30,0),0))","v":0.19}]
[null,"Post tax",null,{"$f":"IFERROR(D49*(1-D50),0)","v":0.34771891794915244},6.7302124730389601E-2,0.77442620621640745,0.73212630342063545,0.70707512623485391,0.89670845426741164,1.3399536354982824,1.8295972166802801,{"$f":"SUM(D51:INDEX(D51:K51,0,MATCH('RFPR cover'!$C$7,$D$6:$K$6,0)))","v":4.8653107683171326},{"$f":"SUM(D51:K51)","v":6.6949079849974122}]
[]
[{"$f":"$A$12","v":"b"},{"$f":"INDEX($B$11:$B$15,MATCH($A53,$A$11:$A$15,0),0)&\"\"","v":"Shrinkage Allowance Revenue Adjustment"},{"$f":"'RFPR cover'!$C$14","v":"£m 09/10"},{"$f":"INDEX($D$11:$K$17,MATCH($A53,$A$11:$A$17,0),0)","v":0.49563233868776463},0.34557911170909084,0.24925849650905818,0.20747448747822247,0.32642748190851484,0.58006104943495007,0.32680976385354238,0.22344513523576701,{"$f":"SUM(D53:INDEX(D53:K53,0,MATCH('RFPR cover'!$C$7,$D$6:$K$6,0)))","v":2.5312427295811437},{"$f":"SUM(D53:K53)","v":2.7546878648169106}]
[null,"Corporation tax rate when recognised in allowed revenue","t+2",{"$f":"IF($C54=$B$33,$B$33,INDEX(Data!$G$14:$G$30,MATCH('R5 - Output Incentives'!D$6+RIGHT('R5 - Output Incentives'!$C54,2),Data!$C$14:$C$30,0),0))","v":0.2},{"$f":"IF($C54=$B$33,$B$33,INDEX(Data!$G$14:$G$30,MATCH('R5 - Output Incentives'!E$6+RIGHT('R5 - Output Incentives'!$C54,2),Data!$C$14:$C$30,0),0))","v":0.2},{"$f":"IF($C54=$B$33,$B$33,INDEX(Data!$G$14:$G$30,MATCH('R5 - Output Incentives'!F$6+RIGHT('R5 - Output Incentives'!$C54,2),Data!$C$14:$C$30,0),0))","v":0.19},{"$f":"IF($C54=$B$33,$B$33,INDEX(Data!$G$14:$G$30,MATCH('R5 - Output Incentives'!G$6+RIGHT('R5 - Output Incentives'!$C54,2),Data!$C$14:$C$30,0),0))","v":0.19},{"$f":"IF($C54=$B$33,$B$33,INDEX(Data!$G$14:$G$30,MATCH('R5 - Output Incentives'!H$6+RIGHT('R5 - Output Incentives'!$C54,2),Data!$C$14:$C$30,0),0))","v":0.19},{"$f":"IF($C54=$B$33,$B$33,INDEX(Data!$G$14:$G$30,MATCH('R5 - Output Incentives'!I$6+RIGHT('R5 - Output Incentives'!$C54,2),Data!$C$14:$C$30,0),0))","v":0.19},{"$f":"IF($C54=$B$33,$B$33,INDEX(Data!$G$14:$G$30,MATCH('R5 - Output Incentives'!J$6+RIGHT('R5 - Output Incentives'!$C54,2),Data!$C$14:$C$30,0),0))","v":0.19},{"$f":"IF($C54=$B$33,$B$33,INDEX(Data!$G$14:$G$30,MATCH('R5 - Output Incentives'!K$6+RIGHT('R5 - Output Incentives'!$C54,2),Data!$C$14:$C$30,0),0))","v":0.19}]
[null,"Post tax",null,{"$f":"IFERROR(D53*(1-D54),0)","v":0.39650587095021173},0.27646328936727266,0.20189938217233713,0.16805433485736021,0.26440626034589704,0.4698494500423096,0.26471590872136935,0.18099055954097129,{"$f":"SUM(D55:INDEX(D55:K55,0,MATCH('RFPR cover'!$C$7,$D$6:$K$6,0)))","v":2.0418944964567576},{"$f":"SUM(D55:K55)","v":2.2228850559977289}]
[]
[{"$f":"$A$13","v":"c"},{"$f":"INDEX($B$11:$B$15,MATCH($A57,$A$11:$A$15,0),0)&\"\"","v":"Environment Emissions Incentive "},{"$f":"'RFPR cover'!$C$14","v":"£m 09/10"},{"$f":"INDEX($D$11:$K$17,MATCH($A57,$A$11:$A$17,0),0)","v":1.5602225035063555},1.5202694599740256,1.4157235028922008,1.2494933333878417,1.7108423318318222,2.4632066735358995,2.8319536950276687,3.6116749607424685,{"$f":"SUM(D57:INDEX(D57:K57,0,MATCH('RFPR cover'!$C$7,$D$6:$K$6,0)))","v":12.751711500155814},{"$f":"SUM(D57:K57)","v":16.363386460898283}]
[null,"Corporation tax rate when recognised in allowed revenue","t+2",{"$f":"IF($C58=$B$33,$B$33,INDEX(Data!$G$14:$G$30,MATCH('R5 - Output Incentives'!D$6+RIGHT('R5 - Output Incentives'!$C58,2),Data!$C$14:$C$30,0),0))","v":0.2},{"$f":"IF($C58=$B$33,$B$33,INDEX(Data!$G$14:$G$30,MATCH('R5 - Output Incentives'!E$6+RIGHT('R5 - Output Incentives'!$C58,2),Data!$C$14:$C$30,0),0))","v":0.2},{"$f":"IF($C58=$B$33,$B$33,INDEX(Data!$G$14:$G$30,MATCH('R5 - Output Incentives'!F$6+RIGHT('R5 - Output Incentives'!$C58,2),Data!$C$14:$C$30,0),0))","v":0.19},{"$f":"IF($C58=$B$33,$B$33,INDEX(Data!$G$14:$G$30,MATCH('R5 - Output Incentives'!G$6+RIGHT('R5 - Output Incentives'!$C58,2),Data!$C$14:$C$30,0),0))","v":0.19},{"$f":"IF($C58=$B$33,$B$33,INDEX(Data!$G$14:$G$30,MATCH('R5 - Output Incentives'!H$6+RIGHT('R5 - Output Incentives'!$C58,2),Data!$C$14:$C$30,0),0))","v":0.19},{"$f":"IF($C58=$B$33,$B$33,INDEX(Data!$G$14:$G$30,MATCH('R5 - Output Incentives'!I$6+RIGHT('R5 - Output Incentives'!$C58,2),Data!$C$14:$C$30,0),0))","v":0.19},{"$f":"IF($C58=$B$33,$B$33,INDEX(Data!$G$14:$G$30,MATCH('R5 - Output Incentives'!J$6+RIGHT('R5 - Output Incentives'!$C58,2),Data!$C$14:$C$30,0),0))","v":0.19},{"$f":"IF($C58=$B$33,$B$33,INDEX(Data!$G$14:$G$30,MATCH('R5 - Output Incentives'!K$6+RIGHT('R5 - Output Incentives'!$C58,2),Data!$C$14:$C$30,0),0))","v":0.19}]
[null,"Post tax",null,{"$f":"IFERROR(D57*(1-D58),0)","v":1.2481780028050844},1.2162155679792206,1.1467360373426827,1.0120896000441519,1.3857822887837761,1.9951974055640787,2.2938824929724118,2.9254567182013997,{"$f":"SUM(D59:INDEX(D59:K59,0,MATCH('RFPR cover'!$C$7,$D$6:$K$6,0)))","v":10.298081395491407},{"$f":"SUM(D59:K59)","v":13.223538113692806}]
[]
[{"$f":"$A$14","v":"d"},{"$f":"INDEX($B$11:$B$15,MATCH($A61,$A$11:$A$15,0),0)&\"\"","v":"Discretionary Reward Scheme"},{"$f":"'RFPR cover'!$C$14","v":"£m 09/10"},{"$f":"INDEX($D$11:$K$17,MATCH($A61,$A$11:$A$17,0),0)","v":4.6586892848831704E-2},4.6586892848831704E-2,2.9574163065161849E-2,2.9574163065161849E-2,2.9574163065161849E-2,0,0,0,{"$f":"SUM(D61:INDEX(D61:K61,0,MATCH('RFPR cover'!$C$7,$D$6:$K$6,0)))","v":0.18189627489314897},{"$f":"SUM(D61:K61)","v":0.18189627489314897}]
[null,"Corporation tax rate when recognised in allowed revenue","t+2",{"$f":"IF($C62=$B$33,$B$33,INDEX(Data!$G$14:$G$30,MATCH('R5 - Output Incentives'!D$6+RIGHT('R5 - Output Incentives'!$C62,2),Data!$C$14:$C$30,0),0))","v":0.2},{"$f":"IF($C62=$B$33,$B$33,INDEX(Data!$G$14:$G$30,MATCH('R5 - Output Incentives'!E$6+RIGHT('R5 - Output Incentives'!$C62,2),Data!$C$14:$C$30,0),0))","v":0.2},{"$f":"IF($C62=$B$33,$B$33,INDEX(Data!$G$14:$G$30,MATCH('R5 - Output Incentives'!F$6+RIGHT('R5 - Output Incentives'!$C62,2),Data!$C$14:$C$30,0),0))","v":0.19},{"$f":"IF($C62=$B$33,$B$33,INDEX(Data!$G$14:$G$30,MATCH('R5 - Output Incentives'!G$6+RIGHT('R5 - Output Incentives'!$C62,2),Data!$C$14:$C$30,0),0))","v":0.19},{"$f":"IF($C62=$B$33,$B$33,INDEX(Data!$G$14:$G$30,MATCH('R5 - Output Incentives'!H$6+RIGHT('R5 - Output Incentives'!$C62,2),Data!$C$14:$C$30,0),0))","v":0.19},{"$f":"IF($C62=$B$33,$B$33,INDEX(Data!$G$14:$G$30,MATCH('R5 - Output Incentives'!I$6+RIGHT('R5 - Output Incentives'!$C62,2),Data!$C$14:$C$30,0),0))","v":0.19},{"$f":"IF($C62=$B$33,$B$33,INDEX(Data!$G$14:$G$30,MATCH('R5 - Output Incentives'!J$6+RIGHT('R5 - Output Incentives'!$C62,2),Data!$C$14:$C$30,0),0))","v":0.19},{"$f":"IF($C62=$B$33,$B$33,INDEX(Data!$G$14:$G$30,MATCH('R5 - Output Incentives'!K$6+RIGHT('R5 - Output Incentives'!$C62,2),Data!$C$14:$C$30,0),0))","v":0.19}]
[null,"Post tax",null,{"$f":"IFERROR(D61*(1-D62),0)","v":3.7269514279065365E-2},3.7269514279065365E-2,2.3955072082781099E-2,2.3955072082781099E-2,2.3955072082781099E-2,0,0,0,{"$f":"SUM(D63:INDEX(D63:K63,0,MATCH('RFPR cover'!$C$7,$D$6:$K$6,0)))","v":0.14640424480647402},{"$f":"SUM(D63:K63)","v":0.14640424480647402}]
[]
[{"$f":"$A$15","v":"e"},{"$f":"INDEX($B$11:$B$15,MATCH($A65,$A$11:$A$15,0),0)&\"\"","v":"NTS Exit Capacity"},{"$f":"'RFPR cover'!$C$14","v":"£m 09/10"},{"$f":"INDEX($D$11:$K$17,MATCH($A65,$A$11:$A$17,0),0)","v":1.11748015},1.2525667600000001,4.4257972199999998,3.2337239599999998,3.13358779,3.0760632499999998,2.42951066,1.80982226,{"$f":"SUM(D65:INDEX(D65:K65,0,MATCH('RFPR cover'!$C$7,$D$6:$K$6,0)))","v":18.66872979},{"$f":"SUM(D65:K65)","v":20.478552050000001}]
[null,"Corporation tax rate when recognised in allowed revenue","t+2",{"$f":"IF($C66=$B$33,$B$33,INDEX(Data!$G$14:$G$30,MATCH('R5 - Output Incentives'!D$6+RIGHT('R5 - Output Incentives'!$C66,2),Data!$C$14:$C$30,0),0))","v":0.2},{"$f":"IF($C66=$B$33,$B$33,INDEX(Data!$G$14:$G$30,MATCH('R5 - Output Incentives'!E$6+RIGHT('R5 - Output Incentives'!$C66,2),Data!$C$14:$C$30,0),0))","v":0.2},{"$f":"IF($C66=$B$33,$B$33,INDEX(Data!$G$14:$G$30,MATCH('R5 - Output Incentives'!F$6+RIGHT('R5 - Output Incentives'!$C66,2),Data!$C$14:$C$30,0),0))","v":0.19},{"$f":"IF($C66=$B$33,$B$33,INDEX(Data!$G$14:$G$30,MATCH('R5 - Output Incentives'!G$6+RIGHT('R5 - Output Incentives'!$C66,2),Data!$C$14:$C$30,0),0))","v":0.19},{"$f":"IF($C66=$B$33,$B$33,INDEX(Data!$G$14:$G$30,MATCH('R5 - Output Incentives'!H$6+RIGHT('R5 - Output Incentives'!$C66,2),Data!$C$14:$C$30,0),0))","v":0.19},{"$f":"IF($C66=$B$33,$B$33,INDEX(Data!$G$14:$G$30,MATCH('R5 - Output Incentives'!I$6+RIGHT('R5 - Output Incentives'!$C66,2),Data!$C$14:$C$30,0),0))","v":0.19},{"$f":"IF($C66=$B$33,$B$33,INDEX(Data!$G$14:$G$30,MATCH('R5 - Output Incentives'!J$6+RIGHT('R5 - Output Incentives'!$C66,2),Data!$C$14:$C$30,0),0))","v":0.19},{"$f":"IF($C66=$B$33,$B$33,INDEX(Data!$G$14:$G$30,MATCH('R5 - Output Incentives'!K$6+RIGHT('R5 - Output Incentives'!$C66,2),Data!$C$14:$C$30,0),0))","v":0.19}]
[null,"Post tax",null,{"$f":"IFERROR(D65*(1-D66),0)","v":0.89398412000000005},1.0020534080000001,3.5848957482000001,2.6193164076,2.5382061099,2.4916112324999999,1.9679036346000001,1.4659560306000001,{"$f":"SUM(D67:INDEX(D67:K67,0,MATCH('RFPR cover'!$C$7,$D$6:$K$6,0)))","v":15.097970660800001},{"$f":"SUM(D67:K67)","v":16.563926691400003}]
[]
[{"$f":"$A$16","v":"f"},{"$f":"INDEX($B$11:$B$17,MATCH($A69,$A$11:$A$17,0),0)&\"\"","v":""},{"$f":"'RFPR cover'!$C$14","v":"£m 09/10"},{"$f":"INDEX($D$11:$K$17,MATCH($A69,$A$11:$A$17,0),0)","v":0},0,0,0,0,0,0,0,{"$f":"SUM(D69:INDEX(D69:K69,0,MATCH('RFPR cover'!$C$7,$D$6:$K$6,0)))","v":0},{"$f":"SUM(D69:K69)","v":0}]
[null,"Corporation tax rate when recognised in allowed revenue","t+2",{"$f":"IF($C70=$B$33,$B$33,INDEX(Data!$G$14:$G$30,MATCH('R5 - Output Incentives'!D$6+RIGHT('R5 - Output Incentives'!$C70,2),Data!$C$14:$C$30,0),0))","v":0.2},{"$f":"IF($C70=$B$33,$B$33,INDEX(Data!$G$14:$G$30,MATCH('R5 - Output Incentives'!E$6+RIGHT('R5 - Output Incentives'!$C70,2),Data!$C$14:$C$30,0),0))","v":0.2},{"$f":"IF($C70=$B$33,$B$33,INDEX(Data!$G$14:$G$30,MATCH('R5 - Output Incentives'!F$6+RIGHT('R5 - Output Incentives'!$C70,2),Data!$C$14:$C$30,0),0))","v":0.19},{"$f":"IF($C70=$B$33,$B$33,INDEX(Data!$G$14:$G$30,MATCH('R5 - Output Incentives'!G$6+RIGHT('R5 - Output Incentives'!$C70,2),Data!$C$14:$C$30,0),0))","v":0.19},{"$f":"IF($C70=$B$33,$B$33,INDEX(Data!$G$14:$G$30,MATCH('R5 - Output Incentives'!H$6+RIGHT('R5 - Output Incentives'!$C70,2),Data!$C$14:$C$30,0),0))","v":0.19},{"$f":"IF($C70=$B$33,$B$33,INDEX(Data!$G$14:$G$30,MATCH('R5 - Output Incentives'!I$6+RIGHT('R5 - Output Incentives'!$C70,2),Data!$C$14:$C$30,0),0))","v":0.19},{"$f":"IF($C70=$B$33,$B$33,INDEX(Data!$G$14:$G$30,MATCH('R5 - Output Incentives'!J$6+RIGHT('R5 - Output Incentives'!$C70,2),Data!$C$14:$C$30,0),0))","v":0.19},{"$f":"IF($C70=$B$33,$B$33,INDEX(Data!$G$14:$G$30,MATCH('R5 - Output Incentives'!K$6+RIGHT('R5 - Output Incentives'!$C70,2),Data!$C$14:$C$30,0),0))","v":0.19}]
[null,"Post tax",null,{"$f":"IFERROR(D69*(1-D70),0)","v":0},0,0,0,0,0,0,0,{"$f":"SUM(D71:INDEX(D71:K71,0,MATCH('RFPR cover'!$C$7,$D$6:$K$6,0)))","v":0},{"$f":"SUM(D71:K71)","v":0}]
[]
["g",{"$f":"INDEX($B$11:$B$17,MATCH($A73,$A$11:$A$17,0),0)&\"\"","v":""},{"$f":"'RFPR cover'!$C$14","v":"£m 09/10"},{"$f":"INDEX($D$11:$K$17,MATCH($A73,$A$11:$A$17,0),0)","v":0},0,0,0,0,0,0,0,{"$f":"SUM(D73:INDEX(D73:K73,0,MATCH('RFPR cover'!$C$7,$D$6:$K$6,0)))","v":0},{"$f":"SUM(D73:K73)","v":0}]
[null,"Corporation tax rate when recognised in allowed revenue","t+2",{"$f":"IF($C74=$B$33,$B$33,INDEX(Data!$G$14:$G$30,MATCH('R5 - Output Incentives'!D$6+RIGHT('R5 - Output Incentives'!$C74,2),Data!$C$14:$C$30,0),0))","v":0.2},{"$f":"IF($C74=$B$33,$B$33,INDEX(Data!$G$14:$G$30,MATCH('R5 - Output Incentives'!E$6+RIGHT('R5 - Output Incentives'!$C74,2),Data!$C$14:$C$30,0),0))","v":0.2},{"$f":"IF($C74=$B$33,$B$33,INDEX(Data!$G$14:$G$30,MATCH('R5 - Output Incentives'!F$6+RIGHT('R5 - Output Incentives'!$C74,2),Data!$C$14:$C$30,0),0))","v":0.19},{"$f":"IF($C74=$B$33,$B$33,INDEX(Data!$G$14:$G$30,MATCH('R5 - Output Incentives'!G$6+RIGHT('R5 - Output Incentives'!$C74,2),Data!$C$14:$C$30,0),0))","v":0.19},{"$f":"IF($C74=$B$33,$B$33,INDEX(Data!$G$14:$G$30,MATCH('R5 - Output Incentives'!H$6+RIGHT('R5 - Output Incentives'!$C74,2),Data!$C$14:$C$30,0),0))","v":0.19},{"$f":"IF($C74=$B$33,$B$33,INDEX(Data!$G$14:$G$30,MATCH('R5 - Output Incentives'!I$6+RIGHT('R5 - Output Incentives'!$C74,2),Data!$C$14:$C$30,0),0))","v":0.19},{"$f":"IF($C74=$B$33,$B$33,INDEX(Data!$G$14:$G$30,MATCH('R5 - Output Incentives'!J$6+RIGHT('R5 - Output Incentives'!$C74,2),Data!$C$14:$C$30,0),0))","v":0.19},{"$f":"IF($C74=$B$33,$B$33,INDEX(Data!$G$14:$G$30,MATCH('R5 - Output Incentives'!K$6+RIGHT('R5 - Output Incentives'!$C74,2),Data!$C$14:$C$30,0),0))","v":0.19}]
[null,"Post tax",null,{"$f":"IFERROR(D73*(1-D74),0)","v":0},0,0,0,0,0,0,0,{"$f":"SUM(D75:INDEX(D75:K75,0,MATCH('RFPR cover'!$C$7,$D$6:$K$6,0)))","v":0},{"$f":"SUM(D75:K75)","v":0}]
[]
[null,"Impact on Allowed Revenue within RIIO-1"]
[null,"This table shows the impact on allowed revenue in the relevant year - with actuals (subject to determination) and forecasts thereafter."]
[null,"The cells above the allowed revenue indicate the year of performance"]
[]
[null,null,"Performance Year ",{"$f":"IF($C50=$B$33,D$6,IF(D$6-RIGHT($C50,1)<$D$6,\"Pre-RIIO\",D$6-RIGHT($C50,1)))","v":"Pre-RIIO"},"Pre-RIIO",2014,2015,2016,2017,2018,2019]
[{"$f":"A11","v":"a"},{"$f":"B11&\"\"","v":"Broad Measure of Customer Satisfaction "},"£m nominal",0,0,0.50710127999999999,0.10007460999999999,1.1495727099999999,1.1100661399999998,1.11220308,1.4535877099999999]
[]
[null,null,"Performance Year ",{"$f":"IF($C54=$B$33,D$6,IF(D$6-RIGHT($C54,1)<$D$6,\"Pre-RIIO\",D$6-RIGHT($C54,1)))","v":"Pre-RIIO"},"Pre-RIIO",2014,2015,2016,2017,2018,2019]
[{"$f":"A12","v":"b"},{"$f":"B12&\"\"","v":"Shrinkage Allowance Revenue Adjustment"},"£m nominal",0,0,0.55656609000000001,0.40594734999999998,0.29600316999999998,0.25166194000000003,0.41590128999999998,0.74328543999999996]
[]
[null,null,"Performance Year ",{"$f":"IF($C58=$B$33,D$6,IF(D$6-RIGHT($C58,1)<$D$6,\"Pre-RIIO\",D$6-RIGHT($C58,1)))","v":"Pre-RIIO"},"Pre-RIIO",2014,2015,2016,2017,2018,2019]
[{"$f":"A13","v":"c"},{"$f":"B13&\"\"","v":"Environment Emissions Incentive "},"£m nominal",0,0,1.7520385199999999,1.7858410200000001,1.6812211100000001,1.5156076000000001,2.1797844,3.15633271]
[]
[null,null,"Performance Year ",{"$f":"IF($C62=$B$33,D$6,IF(D$6-RIGHT($C62,1)<$D$6,\"Pre-RIIO\",D$6-RIGHT($C62,1)))","v":"Pre-RIIO"},"Pre-RIIO",2014,2015,2016,2017,2018,2019]
[{"$f":"A14","v":"d"},{"$f":"B14&\"\"","v":"Discretionary Reward Scheme"},"£m nominal",0.19089473000000001,0.17473432999999999,0,0.11443045,0,0,0.11963184,0]
[]
[null,null,"Performance Year ",{"$f":"IF($C66=$B$33,D$6,IF(D$6-RIGHT($C66,1)<$D$6,\"Pre-RIIO\",D$6-RIGHT($C66,1)))","v":"Pre-RIIO"},"Pre-RIIO",2014,2015,2016,2017,2018,2019]
[{"$f":"A15","v":"e"},{"$f":"B15&\"\"","v":"NTS Exit Capacity"},"£m nominal",0,0,1.4876930800000001,1.6719325199999999,6.0776610899999994,4.5817941799999993,4.5769975499999997,4.5615978099999994]
[]
[null,null,"Performance Year ",{"$f":"IF($C70=$B$33,D$6,IF(D$6-RIGHT($C70,1)<$D$6,\"Pre-RIIO\",D$6-RIGHT($C70,1)))","v":"Pre-RIIO"},"Pre-RIIO",2014,2015,2016,2017,2018,2019]
[{"$f":"A16","v":"f"},{"$f":"B16&\"\"","v":""},"£m nominal",0,0,0,0,0,0,0,0]
[]
[null,null,"Performance Year ",{"$f":"IF($C74=$B$33,D$6,IF(D$6-RIGHT($C74,1)<$D$6,\"Pre-RIIO\",D$6-RIGHT($C74,1)))","v":"Pre-RIIO"},"Pre-RIIO",2014,2015,2016,2017,2018,2019]
[{"$f":"A17","v":"g"},{"$f":"B17&\"\"","v":""},"£m nominal",0,0,0,0,0,0,0,0]
[]
[null,"Total Impact on Allowed Revenue","£m nominal",{"$f":"SUM(D82,D85,D88,D91,D94,D97,D100)","v":0.19089473000000001},0.17473432999999999,4.3033989699999999,4.0782259500000002,9.2044580799999984,7.4591298599999991,8.4045181599999985,9.9148036699999995]
[]
[null,"Additional Commentary"]
[{"$f":"A82","v":"a"}]
[{"$f":"A85","v":"b"}]
[{"$f":"A88","v":"c"}]
[{"$f":"A91","v":"d"}]
[{"$f":"A94","v":"e"}]
[{"$f":"A97","v":"f"}]
[{"$f":"A100","v":"g"}]

{"sheet":"R6 - Innovation","index":9,"n_rows":28,"n_cols":11,"rows_kept":28,"cut":false,"hidden":false,"merged":[]}
["R6 - Innovation"]
[{"$f":"'RFPR cover'!C5","v":"Cadent-London"}]
[{"$f":"'RFPR cover'!C7","v":2020},{"$f":"'R1 - RoRE'!B3","v":""}]
[]
[null,null,null,{"$f":"IF(D6<='RFPR cover'!$C$7,\"Actuals\",\"Forecast\")","v":"Actuals"},{"$f":"IF(E6<='RFPR cover'!$C$7,\"Actuals\",\"Forecast\")","v":"Actuals"},{"$f":"IF(F6<='RFPR cover'!$C$7,\"Actuals\",\"Forecast\")","v":"Actuals"},{"$f":"IF(G6<='RFPR cover'!$C$7,\"Actuals\",\"Forecast\")","v":"Actuals"},{"$f":"IF(H6<='RFPR cover'!$C$7,\"Actuals\",\"Forecast\")","v":"Actuals"},{"$f":"IF(I6<='RFPR cover'!$C$7,\"Actuals\",\"Forecast\")","v":"Actuals"},{"$f":"IF(J6<='RFPR cover'!$C$7,\"Actuals\",\"Forecast\")","v":"Actuals"},{"$f":"IF(K6<='RFPR cover'!$C$7,\"Actuals\",\"Forecast\")","v":"Forecast"}]
[null,null,null,{"$f":"'RFPR cover'!$C$13","v":2014},{"$f":"D6+1","v":2015},2016,2017,2018,2019,2020,2021]
[]
[null,"Network Innovation Allowance"]
[null,"Eligible NIA expenditure and Bid Preparation costs","£m nominal",0.59598324999999996,1.59227418,1.9869391699999999,1.59,1.52304076,1.0073420930000001,1.2596733108329561,1.4523154710987236]
[null,"Unrecoverable Expenditure (eg not conforming to technical requirements)","£m nominal",0,0,0,0,0,0,0,0]
[null,"Company Compulsory Contribution (including % contribution funded by licensee)","£m nominal",6.5002099999999952E-2,0.1592274199999999,0.19869391999999997,0.16125000000000012,0.15230407999999995,0.10073420930000002,0.12596733108329561,0.14523154710987238]
[null,"Allowed NIA adjustment","£m nominal",{"$f":"D9-D10-D11","v":0.53098115000000001},1.4330467600000001,1.7882452499999999,1.42875,1.37073668,0.90660788370000012,1.1337059797496605,1.3070839239888512]
[]
[null,"Low Carbon Networks Fund"]
[null,"Second Tier and Discretionary (as per latest Revenue RRP)","£m nominal",0,0,0,0,0,0,0,0]
[null,"First Tier Funding Mechanism (as per latest Revenue RRP)","£m nominal",0,0,0,0,0,0,0,0]
[null,"Low Carbon Networks Fund revenue adjustment","£m nominal",{"$f":"D15-D16","v":0},0,0,0,0,0,0,0]
[]
[null,"Network Innovation Competition"]
[null,"Awarded NIC funding actually spent or forecast to be spent","£m nominal",0,0.19425738400501635,0.16939150240663295,1.2941172134651164,1.0520570691939999,0.83229366800785543,0.97124072540777007,0]
[null,"Company Compulsory Contribution (including % contribution funded by licensee)","£m nominal",0,0,4.4278647537875186E-2,0.12483322440982278,9.0152914099603743E-2,0.10781956457645001,0.14680689352950169,6.7051504440251458E-2]
[]
[null,"Successful Delivery Rewards","£m nominal",0,0,0,0,0,4.4022878225145064E-2,0,0]
[]
[]
[]
[null,"RoRE Inputs"]
[null,"Network innovation",{"$f":"'RFPR cover'!$C$14","v":"£m 09/10"},{"$f":"(SUM(D10,D11,D21)-D23)/Data!C34","v":5.5715015952219171E-2},{"$f":"(SUM(E10,E11,E21)-E23)/Data!D34","v":0.13385446018046723},{"$f":"(SUM(F10,F11,F21)-F23)/Data!E34","v":0.20207707569948585},{"$f":"(SUM(G10,G11,G21)-G23)/Data!F34","v":0.23294031171218096},{"$f":"(SUM(H10,H11,H21)-H23)/Data!G34","v":0.19029718395204645},{"$f":"(SUM(I10,I11,I21)-I23)/Data!H34","v":0.12530651362473041},{"$f":"(SUM(J10,J11,J21)-J23)/Data!I34","v":0.20250230910202049},{"$f":"(SUM(K10,K11,K21)-K23)/Data!J34","v":0.15405164425666129}]

{"sheet":"R7 - Financing","index":10,"n_rows":92,"n_cols":13,"rows_kept":92,"cut":false,"hidden":false,"merged":[]}
["R7 - Financing"]
[{"$f":"'RFPR cover'!C5","v":"Cadent-London"}]
[{"$f":"'RFPR cover'!C7","v":2020},{"$f":"'R1 - RoRE'!B3","v":""}]
[]
[null,null,null,"Actuals","Actuals","Actuals","Actuals","Actuals","Actuals","Actuals","Forecast"]
[null,null,null,{"$f":"'RFPR cover'!$C$13","v":2014},{"$f":"D6+1","v":2015},2016,2017,2018,2019,2020,2021,{"$f":"\"Cumulative to \"&'RFPR cover'!$C$7","v":"Cumulative to 2020"},"RIIO-1 period"]
[]
[null,"Net Interest Per Statutory Accounts","£m nominal",190,202,157,1009.9592004289094,144.53190509998873,146.48709870298899,158.52901547018013,146.48574394789654]
[]
[null,"Reconciliation with Statutory Accounts"]
[null,"Interest not qualifying for corporation tax relief","£m nominal",0,0,0,0,0,0,0,0]
[null,"Fair value adjustments (e.g. losses on derivatives)","£m nominal",0,0,0,-12.000000000000002,6.4123671655705898,8,11.879117310169971,12.941532286017885]
[null,"Dividends on preference shares","£m nominal",0,0,0,0,0,0,0,0]
[null,"Costs of early redemption on long term debt","£m nominal",0,-18.13,0,0,0,0,-4.3760000000000003,0]
[null,"Swap Termination Costs paid","£m nominal",-0.31693192630363032,0,0,0,0,0,0,0]
[null,"Movements relating to pension fund liabilities reported within net interest","£m nominal",11.220973992277228,0,0,-1,1.99999996,14,17,16.770133815328617]
[null,"Debt issuance expenses (inc. amortisation to discounts that had previously benefitted from a tax deduction)","£m nominal",0,0,0,-1,-2.7502029540310082,-2.77,-4.5662355028141404,-3.9467114437600381]
[null,"Commitment fees for undrawn liquidity backup lines","£m nominal",0,0,0,-1,-2.5096237936986299,-2.15,-2.1329945099999996,-2.6]
[null,"Less: Capitalised Interest","£m nominal",0,11.799999999999999,0,1,0,0,0,0]
[null,"Less: Unwind of discount","£m nominal",-1.2343234323432342,-4.32,-4,-2,-2.1643585699999996,-0.3,-0.30747824000000001,-0.83900828984498743]
[null,"Less: Term Debt / Letter of Credit / RCF Fees","£m nominal",0,0,0,0,-1.6100538071336465,-1.63,-1.6203636499999994,-1.2]
[null,"losses/(gains) on derivative financial instruments ","£m nominal",10.140872224818478,-15.530000000000001,-6,0,0,-18,-15.038963970000001,0]
[null,"Less: Commitment Commission and other","£m nominal",0,-1.24,0,0,0,0,0,0]
[null,"Economic cost of changing capital structure in FY16/17","£m nominal",0,0,0,6.3213676681941591,17.932701426544227,21.727733719139341,22.618722334289604,21.712050540147427]
[null,"Less: Debt cap disallowance","£m nominal",-2.3194369108910893,0,0,0,0,0,0,0]
[null,"Less finance costs relating to metering","£m nominal",-15,-12,-11,0,0,0,0,0]
[null,"Less financing costs relating to other three networks","£m nominal",-146.42626448709569,-125.86000000000001,-105,-123.13940400000007,-109.7986480144599,-108.81770349404869,-120.19281088018398,-125.28666478768373]
[null,"Exceptional costs of early redemption on long term debt- TBC","£m nominal",0,0,0,-833,0,0,0,0]
[null,"Rounding ","£m nominal",-1.0106542336633879,0.35999999999998522,0,-1.4522004289093502,0.32165869143702253,0,0,0]
[null,"Net Interest Per Regulatory (RIIO-1) Definition","£m nominal",{"$f":"SUM(D8,D11:D29)","v":45.054235226798681},37.079999999999984,31,42.688963668194106,52.365745204217404,56.547128928079616,61.79200836164155,64.037076068101712]
[null,"Forecast new financing/refinancing Net Interest costs","£m nominal",null,null,null,null,null,null,null,0]
[null,"Net Interest including forecast new financing/refinancing costs","£m nominal",{"$f":"SUM(D30:D31)","v":45.054235226798681},37.079999999999984,31,42.688963668194106,52.365745204217404,56.547128928079616,61.79200836164155,64.037076068101712]
[null,"External Net Interest","£m nominal",41.963380420990099,34.359999999999985,29,24.444563999999936,34.433043777673163,34.819395208940279,39.173286027351949,42.325025527954274]
[null,"Intra-company Net Interest","£m nominal",3.0908548058085814,2.7199999999999998,2,11.923031999999999,0,0,0,0]
[null,null,null,{"$f":"IF(ABS(D32-SUM(D33:D34))<'RFPR cover'!$F$14,\"OK\",\"ERROR\")","v":"OK"},{"$f":"IF(ABS(E32-SUM(E33:E34))<'RFPR cover'!$F$14,\"OK\",\"ERROR\")","v":"OK"},{"$f":"IF(ABS(F32-SUM(F33:F34))<'RFPR cover'!$F$14,\"OK\",\"ERROR\")","v":"OK"},{"$f":"IF(ABS(G32-SUM(G33:G34))<'RFPR cover'!$F$14,\"OK\",\"ERROR\")","v":"ERROR"},{"$f":"IF(ABS(H32-SUM(H33:H34))<'RFPR cover'!$F$14,\"OK\",\"ERROR\")","v":"ERROR"},{"$f":"IF(ABS(I32-SUM(I33:I34))<'RFPR cover'!$F$14,\"OK\",\"ERROR\")","v":"ERROR"},{"$f":"IF(ABS(J32-SUM(J33:J34))<'RFPR cover'!$F$14,\"OK\",\"ERROR\")","v":"ERROR"},{"$f":"IF(ABS(K32-SUM(K33:K34))<'RFPR cover'!$F$14,\"OK\",\"ERROR\")","v":"ERROR"}]
[]
[null,"Memo: Net interest (RIIO-1) Definition that relates to non-cash principal inflation accretion on bonds and loans","£m nominal",0,0,0,0,7.4136183051980611,6.0973857336367479,6.3742829833770163,7.214076936143714]
[]
[null,"Less inflation in interest charge","£m nominal",40.725241201181255,27.11236851122263,13.673916108530472,27.573482360322554,55.275405259823508,51.403667780598965,47.894583104953952,41.825582263340543]
[]
[null,"Assumed Regulatory finance cost at actual gearing","£m nominal",{"$f":"D32-D39","v":4.3289940256174262},9.9676314887773536,17.32608389146953,15.115481307871551,-2.9096600556061034,5.1434611474806502,13.897425256687598,22.211493804761169]
[]
[null,"Financial Year Average RPI (RPIt)","Index",1.1666890673736021,1.1895563269638081,1.2023757108362261,1.2281396135646323,1.2740965949380583,1.3130274787154661,1.3470178479563604,1.3779992584593566]
[]
[null,"Assumed regulatory finance cost at actual gearing","£m 09/10",{"$f":"D41/D43","v":3.7104950639184975},8.3792850013403495,14.409875162414597,12.307624590008457,-2.2837044437337659,3.9172532417314638,10.317179744702118,16.118654395789928,{"$f":"SUM(D45:INDEX(D45:K45,0,MATCH('RFPR cover'!$C$7,$D$6:$K$6,0)))","v":50.758008360381716},{"$f":"SUM(D45:K45)","v":66.87666275617164}]
[]
[null,"Adjustments to be applied to Assumed Finance cost for performance assessment"]
[null,"Add back Debt Issuance expenses","£m nominal",0,0,0,1,2.7502029540310082,2.77,4.5662355028141404,3.9467114437600381,{"$f":"SUM(D48:INDEX(D48:K48,0,MATCH('RFPR cover'!$C$7,$D$6:$K$6,0)))","v":11.086438456845148},{"$f":"SUM(D48:K48)","v":15.033149900605185}]
[null,"New/refinanced debt issuance expenses","£m nominal",null,null,null,null,null,null,null,0,{"$f":"SUM(D49:INDEX(D49:K49,0,MATCH('RFPR cover'!$C$7,$D$6:$K$6,0)))","v":0},0]
[null,"Costs of early redemption on long term debt (excluding exceptional costs of buy backs associated with M&A activity)","£m nominal",0,18.13,0,0,0,0,4.3760000000000003,0,{"$f":"SUM(D50:INDEX(D50:K50,0,MATCH('RFPR cover'!$C$7,$D$6:$K$6,0)))","v":22.506},22.506]
[null,"Add accrual for inflation accretion on index-linked swaps (if applicable)","£m nominal",0,0,0,0,0,0,0,0,{"$f":"SUM(D51:INDEX(D51:K51,0,MATCH('RFPR cover'!$C$7,$D$6:$K$6,0)))","v":0},0]
[null,"Correction of debt issuance expense add back above ","£m nominal",0,0,0,-0.76400037093455153,-2.093342291562772,-2.0985180110174588,0,0,{"$f":"SUM(D52:INDEX(D52:K52,0,MATCH('RFPR cover'!$C$7,$D$6:$K$6,0)))","v":-4.955860673514783},-4.955860673514783]
[null,"Correction of inflation strip calculation","£m nominal",8.586870315590069,3.6831383899057464,1.2347030574231059,0.87721477061079867,2.9007949436061438,5.7128925089544964,0,0,{"$f":"SUM(D53:INDEX(D53:K53,0,MATCH('RFPR cover'!$C$7,$D$6:$K$6,0)))","v":22.995613986090362},22.995613986090362]
[null,"Other Adjustments [please specify]","£m nominal",0,0,0,0,0,0,0,0,{"$f":"SUM(D54:INDEX(D54:K54,0,MATCH('RFPR cover'!$C$7,$D$6:$K$6,0)))","v":0},0]
[null,"Other Adjustments [please specify]","£m nominal",0,0,0,0,0,0,0,0,{"$f":"SUM(D55:INDEX(D55:K55,0,MATCH('RFPR cover'!$C$7,$D$6:$K$6,0)))","v":0},0]
[]
[null,"Total Adjustments to be applied for performance assessment (at actual gearing)","£m nominal",{"$f":"SUM(D48:D55)","v":8.586870315590069},21.813138389905745,1.2347030574231059,1.1132143996762471,3.55765560607438,6.3843744979370376,8.9422355028141407,3.9467114437600381,{"$f":"SUM(D57:INDEX(D57:K57,0,MATCH('RFPR cover'!$C$7,$D$6:$K$6,0)))","v":51.632191769420722},{"$f":"SUM(D57:K57)","v":55.578903213180759}]
[null,"Total Adjustments to be applied for performance assessment (at actual gearing)","£m 09/10",{"$f":"D57/D43","v":7.3600332391220951},18.337205137297719,1.0268862272379047,0.90642333117582718,2.7922966125243742,4.8623312165430592,6.6385427011089195,2.8640882203177505,{"$f":"SUM(D58:INDEX(D58:K58,0,MATCH('RFPR cover'!$C$7,$D$6:$K$6,0)))","v":41.923718465009898},{"$f":"SUM(D58:K58)","v":44.787806685327652}]
[]
[]
[null,"Cost of Debt out(under)performance at notional gearing"]
[null,"Performance against allowance is impacted by deviating from notional levels of gearing"]
[]
[null,"Notional Gearing","%",0.65,0.65,0.65,0.65,0.65,0.65,0.65,0.65]
[null,"Actual Gearing","%",0.54214586434031709,0.58447114213537965,0.56515672006288487,0.60106118577526912,0.63884519960781239,0.63418091907540164,0.63877585609942478,0.64063182613802361]
[]
[null,"Assumed regulatory finance cost at actual gearing","£m nominal",{"$f":"D41","v":4.3289940256174262},9.9676314887773536,17.32608389146953,15.115481307871551,-2.9096600556061034,5.1434611474806502,13.897425256687598,22.211493804761169]
[null,"Adjustment to regulatory finance cost relating to variance from notional gearing","£m nominal",{"$f":"((D64-D65)/D65)*D67","v":0.86120717618499687},1.1175359397362923,2.6010515908831873,1.230712861102792,-5.0805229732230658E-2,0.12829907945377667,0.2441963005318587,0.32480611672324838]
[null,"Assumed regulatory finance cost at notional gearing","£m nominal",{"$f":"SUM(D67:D68)","v":5.1902012018024228},11.085167428513646,19.927135482352718,16.346194168974343,-2.960465285338334,5.2717602269344273,14.141621557219457,22.536299921484417]
[]
[null,"Assumed regulatory finance cost at notional gearing","£m 09/10",{"$f":"D69/D43","v":4.4486584703209484},9.3187410946795026,16.573135420786095,13.309719830248033,-2.323579936639153,4.014965651816965,10.498466355642234,16.35436288019535,{"$f":"SUM(D71:INDEX(D71:K71,0,MATCH('RFPR cover'!$C$7,$D$6:$K$6,0)))","v":55.840106886854628},{"$f":"SUM(D71:K71)","v":72.194469767049981}]
[null,"Adjustments to be applied for performance assessment (at notional gearing)","£m 09/10",{"$f":"D58*((D64-D65)/D65)+D58","v":8.8242333292545876},20.393108367500385,1.1810459364800052,0.9802249408341841,2.8410525730725831,4.9836177590471085,6.7551907519954302,2.9059707420864935,{"$f":"SUM(D72:INDEX(D72:K72,0,MATCH('RFPR cover'!$C$7,$D$6:$K$6,0)))","v":45.958473658184275},{"$f":"SUM(D72:K72)","v":48.86444440027077}]
[]
[null,"Cost of Debt Allowance"]
[]
[null,"The latest published PCFM contains the allowed cost of debt rate (%) for the reporting year. "]
[null,"However, the RAV does not account for the reporting year actual expenditure and additional allowances. "]
[null,"Consequently the return element of revenue does not currently reflect the monetary allowance. This is updated and available in the forthcoming annual iteration process."]
[null,"To address this timing issue, network operators should forecast the allowance in row 79 (linked to R9-RAV table) - which will be trued-up over time."]
[]
[null,"Cost of Debt Allowance as per latest published PCFM (prior year AIP)","£m 09/10",30.577573810296006,28.57409610747613,27.050698225644481,25.637981460841406,24.310303149791153,21.365650853301574,18.121959577032356,18.55206903823883]
[null,"Forecast revised Cost of Debt Allowance","£m 09/10",30.525675345920991,28.429166170317071,26.788211713839477,25.298512136807705,23.969526865236869,21.065099186795806,17.88087116529999,12.8636948282332,{"$f":"SUM(D82:INDEX(D82:K82,0,MATCH('RFPR cover'!$C$7,$D$6:$K$6,0)))","v":173.95706258421791},{"$f":"SUM(D82:K82)","v":186.82075741245112}]
[]
[]
[null,"Out(under) performance"]
[]
[null,"Pre-Tax performance"]
[null,"Pre-Tax Cost of Debt out(under)performance at actual gearing","£m 09/10",{"$f":"D82-D45-D58","v":19.455147042880398},1.7126760316790026,11.351450324186976,12.084464215623422,23.460934696446259,12.285514728521282,0.92514871948895205,-6.1190477878744787,{"$f":"SUM(D88:INDEX(D88:K88,0,MATCH('RFPR cover'!$C$7,$D$6:$K$6,0)))","v":81.275335758826287},{"$f":"SUM(D88:K88)","v":75.156287970951809}]
[]
[null,"Pre-Tax Cost of Debt out(under)performance at notional gearing","£m 09/10",{"$f":"D82-D71-D72","v":17.252783546345455},-1.282683291862817,9.0340303565733766,11.008567365725488,23.452054228803437,12.066515775931732,0.62721405766232508,-6.3966387940486431,{"$f":"SUM(D90:INDEX(D90:K90,0,MATCH('RFPR cover'!$C$7,$D$6:$K$6,0)))","v":72.158482039179006},{"$f":"SUM(D90:K90)","v":65.761843245130365}]
[]
[null,"Pre-Tax Impact on out(under) performance relating to deviating from notional levels of gearing","£m 09/10",{"$f":"D88-D90","v":2.202363496534943},2.9953593235418197,2.3174199676135991,1.0758968498979335,8.8804676428217988E-3,0.21899895258954949,0.29793466182662698,0.27759100617416443,{"$f":"SUM(D92:INDEX(D92:K92,0,MATCH('RFPR cover'!$C$7,$D$6:$K$6,0)))","v":9.1168537196472936},{"$f":"SUM(D92:K92)","v":9.3944447258214581}]

{"sheet":"R8 - Net Debt","index":11,"n_rows":66,"n_cols":11,"rows_kept":66,"cut":false,"hidden":false,"merged":[]}
["R8 - Net Debt"]
[{"$f":"'RFPR cover'!C5","v":"Cadent-London"}]
[{"$f":"'RFPR cover'!C7","v":2020},{"$f":"'R1 - RoRE'!B3","v":""}]
[]
[null,null,null,"Actuals","Actuals","Actuals","Actuals","Actuals","Actuals","Actuals","Forecast"]
[null,null,null,{"$f":"'RFPR cover'!$C$13","v":2014},{"$f":"D6+1","v":2015},2016,2017,2018,2019,2020,2021]
[]
[null,"Opening Cash, short term deposits and overdrafts (per Balance Sheet)","£m nominal",-513,{"$f":"D10","v":-257.707345971564},-230.1982394366197,-67.950899195456699,-38.999085041106376,-164.53,-328.34,-335.7]
[]
[null,"Closing Cash, short term deposits and overdrafts (per Balance Sheet)","£m nominal",-257.707345971564,-230.1982394366197,-67.950899195456699,-38.999085041106376,-164.53,-328.34,-335.7,-60]
[null,"External borrowings, bonds, external loans and finance leases (+ve)","£m nominal",4571.4768957345968,4673.7218309859154,4702.326904874586,1709.9992703027572,6330.6664657096617,6684.1453641668777,6961.1148593199996,6958.0610927328125]
[null,"Loans from other group companies (+ve)","£m nominal",0,0,0,4311.9991027327596,0,0,0,0]
[null,"Loans to other group companies (-ve)","£m nominal",1196.7677725118483,1241.0411971830986,955.05300520586843,0,0,0,0,0]
[null,"Other amounts due to/(from) group companies per Balance Sheet","£m nominal",0,0,0,0,0,0,0,0]
[null,"Guarantees given on behalf of other group companies (per Notes to the Accounts) (+ve)","£m nominal",0,0,0,0,40.909999999999997,41.91,74.696034390000023,44.098337600000015]
[null,"Currency SWAPS","£m nominal",0,0,0,9.0007120055892251,-14.641297620000001,-4.7476904700000002,-26.100013582391007,0]
[null,"Interest rate SWAPS","£m nominal",0,0,0,0,0,0,0,0]
[null,"Inflation-linked SWAPS","£m nominal",0,0,0,0,5.5225772400000004,34.600522499999997,58.918105934504993,0]
[null,"Interest Rate Forward Contracts","£m nominal",0,0,0,0,0,0,0,0]
[null,"Foreign exchange forward rate contracts","£m nominal",0,0,0,0,0,0,0.10614119000000001,0]
[null,"Other swaps, forward rate contracts & OTC options","£m nominal",-205.53732227488149,-281.56478873239439,-320.42901088499764,0,0,0,0,0]
[null,"Other derivatives including exchange traded futures and options","£m nominal",0,0,0,0,0,0,0,0]
[null,"Total Debt per Statutory Accounts","£m nominal",{"$f":"SUM(D10:D22)","v":5305},5403,5269.0000000000009,5991.9999999999991,6197.9277453296618,6427.5681961968776,6733.0351272521139,6942.1594303328129]
[]
[null,"Conversion to Regulatory (RIIO-1) Definition of Net Debt"]
[null,"Unamortised Issue Costs","£m nominal",0,0,0,11.765293183118228,11.701516381730842,10.9,14.361559514130633,13.079553349237775]
[null,"Fixed asset investments not readily convertible to cash","£m nominal",0,0,0,0,0,0,0,0]
[null,"Preference shares","£m nominal",0,0,0,0,0,0,0,0]
[null,"Long term loans (Not for benefit of regulated business or distribution in nature)","£m nominal",0,0,0,0,0,0,0,0]
[null,"Currency debt amount to reflect ultimate sterling liability","£m nominal",0,0,0,-9.7518340993969446,-5.3491329926277427,-1.74,-17.715890011865479,0]
[null,"Impact of fair value adjustments","£m nominal",42.383737914691942,-6.4196,-28.08,-317.45317610847292,-309.37730910158666,-301.32,-283.65132155000003,-303.09436988599276]
[null,"Accrued Interest","£m nominal",-50.673887440758293,-49.605999999999995,-50.309999999999995,-40.008260430827079,-40.910809477124488,-41.91,-44.098337600000015,-44.098337600000015]
[null,"ILS financial exposure; direct offset with row 180 (no net impact on regulatory net debt)","£m nominal",0,0,0,0,-5.5225772400000004,-34.600521999999998,-58.918105934504993,0]
[null,"ILS financial exposure; financials presented up to FY16/17 relate to pre segmentation derivatives. Post FY 17/18 balances relate to accretions on instrument B2.1. ","£m nominal",57.643347403791466,34.432400000000001,26.325000000000003,0,0,27.848261999999998,37.169196546956499,47.056410642201655]
[null,"Less: Derivatives excluding Cross currency","£m nominal",0,0,0,0,0,0,0,0]
[null,"Net debt relating to Metering","£m nominal",-299,-430,-332,0,0,0,0,0]
[null,"Net debt relating to other three networks","£m nominal",-3904.1598835957343,-3823.2861000000012,-3772.7720000000008,-4281.9804073944924,-4452.2751550216735,-4611.2798562516909,-4788.8128501780393,-4974.5672147530749]
[null,"9. IFRS 16 Lease Liabilities","£m nominal",0,0,0,0,0,0,-30.597696790000001,0]
[null,"10. [Insert adjustment as necessary]","£m nominal",0,0,0,0,0,0,0,0]
[null,"11. [Insert adjustment as necessary]","£m nominal",0,0,0,0,0,0,0,0]
[null,"12. [Insert adjustment as necessary]","£m nominal",6.0000000000400178E-2,-0.72999999999865395,0,-3.0615149928053143E-2,5.9999850000167498E-2,0,0,0]
[null,"Total Net Debt per Regulatory (RIIO-1) definition","£m nominal",{"$f":"SUM(D23,D26:D41)","v":1151.2533142819907},1127.3906999999999,1112.1629999999996,1354.5410000000002,1396.2542777283807,1475.4660799451876,1560.7716812487911,1680.5354720851838]
[null,"Forecast new debt/refinancing","£m nominal",null,null,null,null,null,null,null,0]
[null,"Regulatory Net Debt including forecast new debt/refinancing","£m nominal",{"$f":"SUM(D42:D43)","v":1151.2533142819907},1127.3906999999999,1112.1629999999996,1354.5410000000002,1396.2542777283807,1475.4660799451876,1560.7716812487911,1680.5354720851838]
[null,null,null,"OK","OK","OK","OK","OK","OK","OK","OK"]
[]
[null,"Opening Regulatory Net Debt including forecast new debt/refinancing","£m nominal",929.13824251233825,{"$f":"D48","v":1151.2533142819907},1127.3906999999999,1112.1629999999996,1354.5410000000002,1396.2542777283807,1475.4660799451876,1560.7716812487911]
[null,"Closing Regulatory Net Debt including forecast new debt/refinancing","£m nominal",{"$f":"D44","v":1151.2533142819907},1127.3906999999999,1112.1629999999996,1354.5410000000002,1396.2542777283807,1475.4660799451876,1560.7716812487911,1680.5354720851838]
[]
[null,"Allocation of net debt (Per regulatory definition. Transmission companies only)"]
[null,"System operator allocation (transmission companies only)","%",0,0,0,0,0,0,0,0]
[null,"Transmission or distribution allocation","%",{"$f":"1-D51","v":1},1,1,1,1,1,1,1]
[]
[null,"Average Net Debt (per Regulatory Definition)","£m nominal",{"$f":"AVERAGE(D47:D48)*D52","v":1040.1957783971645},1139.3220071409953,1119.7768499999997,1233.3519999999999,1375.3976388641904,1435.8601788367841,1518.1188805969894,1620.6535766669874]
[null,"Equity RAV","£m nominal",{"$f":"D56-D54","v":878.46826907809282},809.9992253469843,861.57948930956809,818.60548650643705,777.54589066150402,828.25741859926529,858.48766472099055,909.12017253450563]
[null,"Average RAV","£m nominal",1918.6640474752573,1949.3212324879796,1981.3563393095678,2051.9574865064369,2152.9435295256944,2264.1175974360494,2376.6065453179799,2529.773749201493]
[null,"Actual Regulatory Gearing","%",{"$f":"D54/D56","v":0.54214586434031709},0.58447114213537965,0.56515672006288487,0.60106118577526912,0.63884519960781239,0.63418091907540164,0.63877585609942489,0.64063182613802372]
[null,"Notional Gearing","%",0.65,0.65,0.65,0.65,0.65,0.65,0.65,0.65]
[null,"Gearing Ratio delta","%",{"$f":"IF(ISBLANK(D23),\"n/a\",D57-D58)","v":-0.10785413565968294},-6.5528857864620371E-2,-8.4843279937115157E-2,-4.8938814224730898E-2,-1.1154800392187636E-2,-1.5819080924598383E-2,-1.1224143900575134E-2,-9.3681738619763033E-3]
[]
[null,"NPV Neutral assumed Average Net Debt","£m 09/10",{"$f":"D63*D57","v":871.93723103194111},939.82054420371696,913.39594983672225,982.93171967030878,1061.1792913878771,1076.0438149574434,1112.1585965353477,1163.1464091310213]
[null,"NPV Neutral assumed Equity RAV","£m 09/10",{"$f":"D63*(1-D57)","v":736.37021606610892},{"$f":"E63*(1-E57)","v":668.16396769204493},702.78575235570486,652.39550313561915,599.9105814629105,620.70199146992718,628.9194137178157,652.47741983626167]
[null,"NPV Neutral assumed Average RAV","£m 09/10",1608.30744709805,1607.9845118957619,1616.1817021924271,1635.3272228059279,1661.0898728507877,1696.7458064273706,1741.0780102531635,1815.6238289672831]
[null,"Actual Regulatory Gearing","%",{"$f":"D61/D63","v":0.54214586434031709},0.58447114213537965,0.56515672006288487,0.60106118577526912,0.63884519960781239,0.63418091907540164,0.63877585609942478,0.64063182613802361]
[null,"Notional Gearing","%",0.65,0.65,0.65,0.65,0.65,0.65,0.65,0.65]
[null,"Gearing Ratio delta","%",{"$f":"IF(ISBLANK(D23),\"n/a\",D64-D65)","v":-0.10785413565968294},-6.5528857864620371E-2,-8.4843279937115157E-2,-4.8938814224730898E-2,-1.1154800392187636E-2,-1.5819080924598383E-2,-1.1224143900575245E-2,-9.3681738619764143E-3]

{"sheet":"R9 - RAV","index":12,"n_rows":59,"n_cols":11,"rows_kept":59,"cut":false,"hidden":false,"merged":[]}
["R9 - Regulatory Asset Value (RAV)"]
[{"$f":"'RFPR cover'!C5","v":"Cadent-London"}]
[{"$f":"'RFPR cover'!C7","v":2020}]
[]
[null,null,null,{"$f":"IF(D6<='RFPR cover'!$C$7-1,\"Actuals\",\"Forecast\")","v":"Actuals"},{"$f":"IF(E6<='RFPR cover'!$C$7-1,\"Actuals\",\"Forecast\")","v":"Actuals"},{"$f":"IF(F6<='RFPR cover'!$C$7-1,\"Actuals\",\"Forecast\")","v":"Actuals"},{"$f":"IF(G6<='RFPR cover'!$C$7-1,\"Actuals\",\"Forecast\")","v":"Actuals"},{"$f":"IF(H6<='RFPR cover'!$C$7-1,\"Actuals\",\"Forecast\")","v":"Actuals"},{"$f":"IF(I6<='RFPR cover'!$C$7-1,\"Actuals\",\"Forecast\")","v":"Actuals"},{"$f":"IF(J6<='RFPR cover'!$C$7,\"Actuals\",\"N/A\")","v":"Actuals"},{"$f":"IF(K6<='RFPR cover'!$C$7-1,\"Actuals\",\"Forecast\")","v":"Forecast"}]
[null,null,null,{"$f":"'RFPR cover'!$C$13","v":2014},{"$f":"D6+1","v":2015},2016,2017,2018,2019,2020,2021]
[]
[null,"RAV per latest published PCFM"]
[null,"The latest published PCFM does not account for the impact of the reporting years totex. This will be published in the forthcoming annual iteration process."]
[]
[null,"Closing RAV per latest published PCFM",{"$f":"'RFPR cover'!$C$14","v":"£m 09/10"},1645.3710935317786,1652.0118315990005,1676.0747145712799,1701.5685442678785,1730.1716126066112,1767.9928584053923,1811.2399636893697,1853.5287174947398]
[]
[null,"Revised RAV - including forecast totex, allowances and enduring value"]
[null,"Revised adjusted RAV including forecast totex, allowances and enduring value"]
[]
[null,"Opening RAV (before transfers)",{"$f":"'RFPR cover'!$C$14","v":"£m 09/10"},1643.6116038196683,{"$f":"D29","v":1639.7458199871039},1641.0532641768953,1655.0023285697821,1678.5332974373514,1705.9077757244729,1748.1090314489452,1792.5190535283971]
[null,"Transfers",{"$f":"'RFPR cover'!$C$14","v":"£m 09/10"},0,0,0,0,0,0,0,0]
[null,"Opening RAV (after transfers)",{"$f":"'RFPR cover'!$C$14","v":"£m 09/10"},{"$f":"SUM(D16:D17)","v":1643.6116038196683},1639.7458199871039,1641.0532641768953,1655.0023285697821,1678.5332974373514,1705.9077757244729,1748.1090314489452,1792.5190535283971]
[null,"Net additions (after disposals)",{"$f":"'RFPR cover'!$C$14","v":"£m 09/10"},82.977864312581161,89.837938184960251,101.67994543487893,104.1790159042514,113.09110599887673,129.79503966156372,144.10651601535588,171.67140831294827]
[null,"Net additions (after disposals) - enduring value adjustment",{"$f":"'RFPR cover'!$C$14","v":"£m 09/10"},-5.6252735446745419,-5.5778709880688098,-10.595476773043657,-2.8943676316215061,-2.264877455282857,3.2894873368950641,-0.52102801935478738,40.021888414391327]
[null,"Total Net Additions",{"$f":"'RFPR cover'!$C$14","v":"£m 09/10"},{"$f":"SUM(D19:D20)","v":77.352590767906619},84.260067196891441,91.084468661835274,101.28464827262989,110.82622854359387,133.08452699845878,143.58548799600109,211.6932967273396]
[null,"Depreciation",{"$f":"'RFPR cover'!$C$14","v":"£m 09/10"},-81.218374600470867,-83.197200117738205,-77.617062462599449,-78.685186207652819,-84.488037660144087,-91.994173650170524,-100.11730085645017,-110.27978824698435]
[null,"Depreciation - enduring value adjustment",{"$f":"'RFPR cover'!$C$14","v":"£m 09/10"},0,0.24457711063801924,0.48165819365100049,0.93150680259226704,1.0362874036716789,1.1109023761840433,0.94183493990099976,0.94162033295913261]
[null,"Total Depreciation",{"$f":"'RFPR cover'!$C$14","v":"£m 09/10"},{"$f":"SUM(D22:D23)","v":-81.218374600470867},-82.952623007100186,-77.135404268948449,-77.753679405060552,-83.451750256472408,-90.88327127398648,-99.175465916549172,-109.33816791402522]
[null,"[Input other adjustment]",{"$f":"'RFPR cover'!$C$14","v":"£m 09/10"},0,0,0,0,0,0,0,0]
[null,"[Input other adjustment]",{"$f":"'RFPR cover'!$C$14","v":"£m 09/10"},0,0,0,0,0,0,0,0]
[null,"[Input other adjustment]",{"$f":"'RFPR cover'!$C$14","v":"£m 09/10"},0,0,0,0,0,0,0,0]
[null,"Other adjustments",{"$f":"'RFPR cover'!$C$14","v":"£m 09/10"},{"$f":"SUM(D25:D27)","v":0},0,0,0,0,0,0,0]
[null,"Adjusted Closing RAV",{"$f":"'RFPR cover'!$C$14","v":"£m 09/10"},{"$f":"D18+D21+D24+D28","v":1639.7458199871039},1641.0532641768953,1655.0023285697821,1678.5332974373514,1705.9077757244729,1748.1090314489452,1792.5190535283971,1894.8741823417115]
[]
[null,"Total enduring value and other adjustments",{"$f":"'RFPR cover'!$C$14","v":"£m 09/10"},{"$f":"(D20+D23+D28)","v":-5.6252735446745419},-5.3332938774307905,-10.113818579392657,-1.9628608290292391,-1.2285900516111781,4.4003897130791074,0.42080692054621238,40.96350874735046]
[null,"CHECK",null,{"$f":"IF(D5=\"Actuals\",IF(ABS((D29-SUM($D$31:D31))-D11)<'RFPR cover'!$F$14,\"TRUE\",\"FALSE\"),\"NA\")","v":"TRUE"},{"$f":"IF(E5=\"Actuals\",IF(ABS((E29-SUM($D$31:E31))-E11)<'RFPR cover'!$F$14,\"TRUE\",\"FALSE\"),\"NA\")","v":"TRUE"},{"$f":"IF(F5=\"Actuals\",IF(ABS((F29-SUM($D$31:F31))-F11)<'RFPR cover'!$F$14,\"TRUE\",\"FALSE\"),\"NA\")","v":"TRUE"},{"$f":"IF(G5=\"Actuals\",IF(ABS((G29-SUM($D$31:G31))-G11)<'RFPR cover'!$F$14,\"TRUE\",\"FALSE\"),\"NA\")","v":"TRUE"},{"$f":"IF(H5=\"Actuals\",IF(ABS((H29-SUM($D$31:H31))-H11)<'RFPR cover'!$F$14,\"TRUE\",\"FALSE\"),\"NA\")","v":"TRUE"},{"$f":"IF(I5=\"Actuals\",IF(ABS((I29-SUM($D$31:I31))-I11)<'RFPR cover'!$F$14,\"TRUE\",\"FALSE\"),\"NA\")","v":"TRUE"},{"$f":"IF(J5=\"Actuals\",IF(ABS((J29-SUM($D$31:J31))-J11)<'RFPR cover'!$F$14,\"TRUE\",\"FALSE\"),\"NA\")","v":"FALSE"},{"$f":"IF(K5=\"Actuals\",IF(ABS((K29-SUM($D$31:K31))-K11)<'RFPR cover'!$F$14,\"TRUE\",\"FALSE\"),\"NA\")","v":"NA"}]
[]
[null,"Year end RPI","Index",{"$f":"Data!C$35","v":1.1829890576408812},{"$f":"Data!D$35","v":1.1936487043894572},{"$f":"Data!E$35","v":1.2107968317676012},{"$f":"Data!F$35","v":1.2511181042513455},{"$f":"Data!G$35","v":1.2930614968924812},{"$f":"Data!H$35","v":1.3285164089040491},{"$f":"Data!I$35","v":1.3560924515797135},{"$f":"Data!J$35","v":1.3872825779660467}]
[null,"Financial Year Average RPI (RPIt)","Index",{"$f":"Data!C$34","v":1.1666890673736021},{"$f":"Data!D$34","v":1.1895563269638081},{"$f":"Data!E$34","v":1.2023757108362261},{"$f":"Data!F$34","v":1.2281396135646323},{"$f":"Data!G$34","v":1.2740965949380583},{"$f":"Data!H$34","v":1.3130274787154661},{"$f":"Data!I$34","v":1.3470178479563604},{"$f":"Data!J$34","v":1.3779992584593566}]
[null,"Index for Opening RAV conversion to nominal in yr 1","Index",{"$f":"INDEX(Data!$F$14:$F$30,MATCH($D$6-1,Data!$C$14:$C$30,0),0)/IF('RFPR cover'!$C$6=\"ED1\",Data!$E$17,Data!$E$14)","v":1.1544860891609932}]
[]
[null,"Adjusted Closing RAV","£m nominal",{"$f":"D29*D34","v":1939.8013623571183},1958.8411026188408,2003.8715760002947,2100.0433970125791,2205.8436620388102,2322.3915328332882,2430.8215578026716,2628.7259406003145]
[]
[null,"Cost of debt","annual real %",{"$f":"INDEX(Data!$K$73:$T$100,MATCH('RFPR cover'!$C$5,Data!$B$73:$B$100,0),MATCH('R9 - RAV'!D$6,Data!$K$72:$T$72,0))","v":2.92E-2},{"$f":"INDEX(Data!$K$73:$T$100,MATCH('RFPR cover'!$C$5,Data!$B$73:$B$100,0),MATCH('R9 - RAV'!E$6,Data!$K$72:$T$72,0))","v":2.7199999999999998E-2},{"$f":"INDEX(Data!$K$73:$T$100,MATCH('RFPR cover'!$C$5,Data!$B$73:$B$100,0),MATCH('R9 - RAV'!F$6,Data!$K$72:$T$72,0))","v":2.5499999999999998E-2},{"$f":"INDEX(Data!$K$73:$T$100,MATCH('RFPR cover'!$C$5,Data!$B$73:$B$100,0),MATCH('R9 - RAV'!G$6,Data!$K$72:$T$72,0))","v":2.3800000000000002E-2},{"$f":"INDEX(Data!$K$73:$T$100,MATCH('RFPR cover'!$C$5,Data!$B$73:$B$100,0),MATCH('R9 - RAV'!H$6,Data!$K$72:$T$72,0))","v":2.2200000000000001E-2},{"$f":"INDEX(Data!$K$73:$T$100,MATCH('RFPR cover'!$C$5,Data!$B$73:$B$100,0),MATCH('R9 - RAV'!I$6,Data!$K$72:$T$72,0))","v":1.9099999999999999E-2},{"$f":"INDEX(Data!$K$73:$T$100,MATCH('RFPR cover'!$C$5,Data!$B$73:$B$100,0),MATCH('R9 - RAV'!J$6,Data!$K$72:$T$72,0))","v":1.5800000000000002E-2},{"$f":"INDEX(Data!$K$73:$T$100,MATCH('RFPR cover'!$C$5,Data!$B$73:$B$100,0),MATCH('R9 - RAV'!K$6,Data!$K$72:$T$72,0))","v":1.09E-2}]
[null,"Cost of equity","annual real %",{"$f":"'RFPR cover'!$C$10","v":6.7000000000000004E-2},{"$f":"'RFPR cover'!$C$10","v":6.7000000000000004E-2},{"$f":"'RFPR cover'!$C$10","v":6.7000000000000004E-2},{"$f":"'RFPR cover'!$C$10","v":6.7000000000000004E-2},{"$f":"'RFPR cover'!$C$10","v":6.7000000000000004E-2},{"$f":"'RFPR cover'!$C$10","v":6.7000000000000004E-2},{"$f":"'RFPR cover'!$C$10","v":6.7000000000000004E-2},{"$f":"'RFPR cover'!$C$10","v":6.7000000000000004E-2}]
[null,"Notional gearing","%",{"$f":"'RFPR cover'!$C$12","v":0.65},{"$f":"'RFPR cover'!$C$12","v":0.65},{"$f":"'RFPR cover'!$C$12","v":0.65},{"$f":"'RFPR cover'!$C$12","v":0.65},{"$f":"'RFPR cover'!$C$12","v":0.65},{"$f":"'RFPR cover'!$C$12","v":0.65},{"$f":"'RFPR cover'!$C$12","v":0.65},{"$f":"'RFPR cover'!$C$12","v":0.65}]
[null,"Vanilla WACC","annual real %",{"$f":"D40*D42+D41*(1-D42)","v":4.2429999999999995E-2},4.113E-2,4.0024999999999998E-2,3.8919999999999996E-2,3.7879999999999997E-2,3.5864999999999994E-2,3.372E-2,3.0535E-2]
[]
[null,"NPV-neutral debt element of RAV",{"$f":"'RFPR cover'!$C$14","v":"£m 09/10"},{"$f":"D47*D42","v":1045.3998406137325},1045.1899327322453,1050.5181064250776,1062.9626948238531,1079.708417353012,1102.8847741777909,1131.7007066645563,1180.155488828734]
[null,"NPV-neutral equity element of RAV",{"$f":"'RFPR cover'!$C$14","v":"£m 09/10"},{"$f":"D47*(1-D42)","v":562.90760648431751},562.79457916351657,565.66359576734942,572.36452798207472,581.38145549777562,593.86103224957969,609.37730358860722,635.46834013854902]
[null,"NPV-neutral RAV return base",{"$f":"'RFPR cover'!$C$14","v":"£m 09/10"},{"$f":"AVERAGE(D16,D29*(1/(1+D43)))","v":1608.30744709805},{"$f":"AVERAGE(E16,E29*(1/(1+E43)))","v":1607.9845118957619},1616.1817021924271,1635.3272228059279,1661.0898728507877,1696.7458064273706,1741.0780102531635,1815.6238289672831]
[]
[null,"Debt Return on RAV",{"$f":"'RFPR cover'!$C$14","v":"£m 09/10"},{"$f":"D40*D45","v":30.525675345920991},28.429166170317071,26.788211713839477,25.298512136807705,23.969526865236869,21.065099186795806,17.88087116529999,12.8636948282332]
[null,"Equity Return on RAV",{"$f":"'RFPR cover'!$C$14","v":"£m 09/10"},37.714809634449274,37.70723680395561,37.899460916412416,38.348423374799012,38.952557518350972,39.788689160721844,40.828279340436687,42.576378789282785]
[null,"Total return on RAV",{"$f":"'RFPR cover'!$C$14","v":"£m 09/10"},{"$f":"SUM(D49:D50)","v":68.240484980370269},66.136402974272684,64.687672630251896,63.646935511606713,62.922084383587844,60.85378834751765,58.709150505736673,55.440073617515985]
[]
[null,"NPV-neutral debt element of RAV","£m nominal",{"$f":"D$35*D45","v":1219.6565650781479},1243.3122973605193,1263.1174549591788,1305.4665932545872,1375.6528180754326,1448.1180143523409,1524.4210504219827,1626.2533884727347]
[null,"NPV-neutral equity element of RAV","£m nominal",656.73815042669503,669.47585242489492,680.14016805494236,702.94355021400838,740.73613280984819,779.75585388202978,820.84210407337537,875.67490148531874]
[null,"Adjusted NPV-neutral average RAV","£m nominal",{"$f":"SUM(D53:D54)","v":1876.3947155048429},1912.7881497854141,1943.2576230141212,2008.4101434685956,2116.3889508852808,2227.8738682343705,2345.2631544953583,2501.9282899580535]
[]
[null,"Debt Return on RAV","£m nominal",{"$f":"D$35*D49","v":35.613971700281922},33.818094488206128,32.209495101459062,31.070104919459176,30.539492561274603,27.659054074129713,24.08585259666733,17.72616193435281]
[null,"Equity Return on NPV-neutral RAV","£m nominal",44.001456078588568,44.854882112467955,45.569391259681147,47.097217864338567,49.629320898259834,52.243642210095999,54.996420972916155,58.670218399516358]
[null,"Total return on RAV","£m nominal",{"$f":"SUM(D57:D58)","v":79.615427778870497},78.672976600674076,77.778886361140209,78.167322783797744,80.168813459534434,79.902696284225712,79.082273569583492,76.39638033386916]

{"sheet":"R10 - Tax","index":13,"n_rows":91,"n_cols":11,"rows_kept":91,"cut":false,"hidden":false,"merged":[]}
["R10 - Tax"]
[{"$f":"'RFPR cover'!C5","v":"Cadent-London"}]
[{"$f":"'RFPR cover'!C7","v":2020}]
[]
[null,null,null,{"$f":"IF(D6<=('RFPR cover'!$C$7-1),\"Actuals\",\"Forecast\")","v":"Actuals"},{"$f":"IF(E6<=('RFPR cover'!$C$7-1),\"Actuals\",\"Forecast\")","v":"Actuals"},{"$f":"IF(F6<=('RFPR cover'!$C$7-1),\"Actuals\",\"Forecast\")","v":"Actuals"},{"$f":"IF(G6<=('RFPR cover'!$C$7-1),\"Actuals\",\"Forecast\")","v":"Actuals"},{"$f":"IF(H6<=('RFPR cover'!$C$7-1),\"Actuals\",\"Forecast\")","v":"Actuals"},{"$f":"IF(I6<=('RFPR cover'!$C$7-1),\"Actuals\",\"Forecast\")","v":"Actuals"},{"$f":"IF(J6<='RFPR cover'!$C$7,\"Actuals\",\"N/A\")","v":"Actuals"},{"$f":"IF(K6<=('RFPR cover'!$C$7-1),\"Actuals\",\"Forecast\")","v":"Forecast"}]
[null,null,null,{"$f":"'RFPR cover'!$C$13","v":2014},{"$f":"D6+1","v":2015},2016,2017,2018,2019,2020,2021]
[]
[null,"CT600 will not have been submitted for the current reporting year."]
[null,"It is assumed the current tax charge per the statutory accounts will equal the tax liability in the forthcoming CT600, where this is not the case the licensee should provide an explanation in the commentary of the variance."]
[null,"This will be corrected / trued-up in future years"]
[]
[null,"Tax liability per latest submitted CT600 (pre-group relief)","£m nominal",154.97499999999999,126.992,134.012,-25.700000000000003,125.2,132.89854,0]
[]
[null,"Adjustments to remove non-regulated tax liability"]
[null,"Tax on non-regulated activities","£m nominal",44.646861896599994,42.479745299009103,43.448628707787009,0.42932539180568441,0.75525026219999947,0.58498642722921945,0]
[null,"Tax relating to capital contributions (excluded services)","£m nominal",-4.4987910741962196,-3.4279182537475927,-83.872056423169354,-0.74898047209831731,-0.56426978887450829,-0.21576399999999996,0]
[null,"Tax on Separation costs/restructuring costs","£m nominal",1.3815931914820534,0,0,-2.2800911399999997,-3.8,-3.1159999999999997,0]
[null,"Transfer pricing and de-grouping charge adjustment ","£m nominal",7.1605440000000016,6.691860000000001,7.863804,-4,0,0,0]
[null,"Tax on Payment to Energy Savings Trust, GSOP and Grenfell","£m nominal",0,0,0,0,0,-3.1160000000000005,0]
[null,"Tax relating to other three networks (included in CT600)","£m nominal",82.118314486665028,61.768419146539912,123.15087286981139,-22.208463520534192,99.451076579990058,110.85292887297561,0]
[null,"Non-regulated tax","£m nominal",{"$f":"SUM(D15:D20)","v":130.80852250055085},107.51210619180142,90.59124915442905,-28.808209740826825,95.842057053315557,104.99015130020483,0,0]
[]
[null,"Other adjustments"]
[null,"Tax on output incentives","£m nominal",{"$f":"('R5 - Output Incentives'!D102)*INDEX(Data!$G$14:$G$30,MATCH('R10 - Tax'!D$6,Data!$C$14:$C$30,0),1)","v":4.3905787900000007E-2},{"$f":"('R5 - Output Incentives'!E102)*INDEX(Data!$G$14:$G$30,MATCH('R10 - Tax'!E$6,Data!$C$14:$C$30,0),1)","v":3.6694209299999996E-2},{"$f":"('R5 - Output Incentives'!F102)*INDEX(Data!$G$14:$G$30,MATCH('R10 - Tax'!F$6,Data!$C$14:$C$30,0),1)","v":0.86067979400000005},{"$f":"('R5 - Output Incentives'!G102)*INDEX(Data!$G$14:$G$30,MATCH('R10 - Tax'!G$6,Data!$C$14:$C$30,0),1)","v":0.81564519000000013},{"$f":"('R5 - Output Incentives'!H102)*INDEX(Data!$G$14:$G$30,MATCH('R10 - Tax'!H$6,Data!$C$14:$C$30,0),1)","v":1.7488470351999996},{"$f":"('R5 - Output Incentives'!I102)*INDEX(Data!$G$14:$G$30,MATCH('R10 - Tax'!I$6,Data!$C$14:$C$30,0),1)","v":1.4172346733999999},{"$f":"('R5 - Output Incentives'!J102)*INDEX(Data!$G$14:$G$30,MATCH('R10 - Tax'!J$6,Data!$C$14:$C$30,0),1)","v":1.5968584503999996},{"$f":"('R5 - Output Incentives'!K102)*INDEX(Data!$G$14:$G$30,MATCH('R10 - Tax'!K$6,Data!$C$14:$C$30,0),1)","v":1.8838126973}]
[null,"Tax on IQI","£m nominal",{"$f":"('R4 - Totex'!D77-'R4 - Totex'!D79)*D41","v":0.32803067052950313},{"$f":"('R4 - Totex'!E77-'R4 - Totex'!E79)*E41","v":0.30471830229616675},{"$f":"('R4 - Totex'!F77-'R4 - Totex'!F79)*F41","v":0.31122689264557224},{"$f":"('R4 - Totex'!G77-'R4 - Totex'!G79)*G41","v":0.30940266492499396},{"$f":"('R4 - Totex'!H77-'R4 - Totex'!H79)*H41","v":0.31083132104181477},{"$f":"('R4 - Totex'!I77-'R4 - Totex'!I79)*I41","v":0.31629745471584098},{"$f":"('R4 - Totex'!J77-'R4 - Totex'!J79)*J41","v":0.32227181377164826},{"$f":"('R4 - Totex'!K77-'R4 - Totex'!K79)*K41","v":0.32920617960192577}]
[null,"Collected revenue adjustment ('k')","£m nominal",1.9162236123841843,0.26470239868037937,-1.8182185499503953,0.56669688935671714,-0.40464905261760359,-0.3850356338703449,0]
[null,"Pension - timing adjustment","£m nominal",0.38097975484758556,0.14578622102044797,1.1212061646748595E-3,-4.4883908828539099E-3,-0.97024382130672582,-0.67246471048832335,0]
[null,"Pension - disallowed contributions","£m nominal",0,0,0,0,0,0,0]
[null,"Tax on derivatives not disregarded","£m nominal",0,0,0,0,0,0,0]
[null,"Tax arising from MOD values","£m nominal",-0.40300276622421027,-0.29935010426142578,2.819541335839622,2.4180374498677235,-1.3524185710036376,-2.2768559146271636,0]
[null,"Tax on finance costs not included within the RIIO 1 definition ","£m nominal",0.40612606568316822,-1.1025,-0.2,-38.577600000000004,-2.0744057228803615E-2,6.6698107190407543E-2,0]
[null,"Difference between actual and allowed pass through costs (inc exit capacity and shrinkage)","£m nominal",0.36875805794884009,0.48105204446883698,4.723974137303466E-2,-9.4180090380654141E-2,-3.802611596900177,-3.1783866457789056,0]
[null,"Other revenue timing adjustments ","£m nominal",-2.3647503762500001E-2,-3.7408896963510144E-2,0.43518848839781055,-1.1690012786908164,-1.8389463331438898,-0.45523495670206415,0]
[null,"Regulatory tax losses carried forward from previous price controls","£m nominal",5.6500321992001936,0,0,0,0,0,0]
[null,0,"£m nominal",0,0,0,0,0,0,0]
[null,"Total other adjustments","£m nominal",{"$f":"SUM(D24:D35)","v":8.6674058785067647},-0.20630582545910481,2.4567789084703193,-35.735487565804888,-6.3299350759590229,-5.1677476261605531,1.9191302641716479,2.2130188769019257]
[]
[null,"Forecast regulated tax liability (including impact of enduring value adjustments)","£m nominal",null,null,null,null,null,null,32.403001076632897,34.595518288770712]
[null,"Adjusted forecast regulated tax liability with timing differences ","£m nominal",{"$f":"D12+D38-D21-D36","v":15.499071620942379},19.686199633657687,40.963971937100631,38.843697306631711,35.687878022643467,33.076136325955723,30.483870812461248,32.382499411868785]
[]
[null,"Financial year average RPI","Index",{"$f":"Data!C$34","v":1.1666890673736021},{"$f":"Data!D$34","v":1.1895563269638081},{"$f":"Data!E$34","v":1.2023757108362261},{"$f":"Data!F$34","v":1.2281396135646323},{"$f":"Data!G$34","v":1.2740965949380583},{"$f":"Data!H$34","v":1.3130274787154661},{"$f":"Data!I$34","v":1.3470178479563604},{"$f":"Data!J$34","v":1.3779992584593566}]
[]
[null,"Adjusted/forecast regulated tax liability with timing differences ",{"$f":"'RFPR cover'!$C$14","v":"£m 09/10"},{"$f":"D39/D41","v":13.284663458648147},16.549195012819794,34.069194485483315,31.628079476965357,28.010339376488542,25.190741901543511,22.630636155794161,23.499649374320683]
[]
[null,"Tax out(under)performance at notional gearing"]
[null,"Performance against allowance is impacted by deviating from notional levels of gearing"]
[]
[null,"Notional Gearing","%",{"$f":"'RFPR cover'!$C$12","v":0.65},{"$f":"'RFPR cover'!$C$12","v":0.65},{"$f":"'RFPR cover'!$C$12","v":0.65},{"$f":"'RFPR cover'!$C$12","v":0.65},{"$f":"'RFPR cover'!$C$12","v":0.65},{"$f":"'RFPR cover'!$C$12","v":0.65},{"$f":"'RFPR cover'!$C$12","v":0.65},{"$f":"'RFPR cover'!$C$12","v":0.65}]
[null,"Actual Gearing","%",{"$f":"'R8 - Net Debt'!D57","v":0.54214586434031709},{"$f":"'R8 - Net Debt'!E57","v":0.58447114213537965},{"$f":"'R8 - Net Debt'!F57","v":0.56515672006288487},{"$f":"'R8 - Net Debt'!G57","v":0.60106118577526912},{"$f":"'R8 - Net Debt'!H57","v":0.63884519960781239},{"$f":"'R8 - Net Debt'!I57","v":0.63418091907540164},{"$f":"'R8 - Net Debt'!J57","v":0.63877585609942489},{"$f":"'R8 - Net Debt'!K57","v":0.64063182613802372}]
[]
[null,"Adjusted/forecast regulated tax liability with timing differences ","£m nominal",{"$f":"D39","v":15.499071620942379},19.686199633657687,40.963971937100631,38.843697306631711,35.687878022643467,33.076136325955723,30.483870812461248,32.382499411868785]
[null,"Adjustment to regulatory tax cost relating to variance from notional gearing","£m nominal",{"$f":"D87-D89","v":-0.34452362335437936},-0.22274468708732797,-0.4913328792526741,-0.12981656832602795,4.4667500285744843E-2,6.4354554022523658E-2,0.43536029742992044,0.35730154889180721]
[null,"Revised regulated tax liability for comparison against allowance","£m nominal",{"$f":"SUM(D51:D52)","v":15.154547997588001},19.463454946570359,40.472639057847957,38.713880738305683,35.732545522929215,33.140490879978245,30.919231109891168,32.73980096076059]
[]
[null,"Revised regulated tax liability for comparison against allowance",{"$f":"'RFPR cover'!$C$14","v":"£m 09/10"},{"$f":"D53/D41","v":12.989363165717526},16.361944790162532,33.660559418403523,31.522377676541186,28.045397550620088,25.23975424520404,22.953839221061951,23.758939462249526]
[]
[]
[null,"Allowance"]
[]
[null,"The latest published PCFM does not account for the forecast TIM performance - and ultimate impact on tax allowance."]
[]
[null,"Tax Allowance per latest published PCFM",{"$f":"'RFPR cover'!$C$14","v":"£m 09/10"},8.0038105903628463,10.465708460187001,29.25380393188227,27.846649888264462,25.886158840487187,23.653632178616633,23.662777768095424,20.344600557579394]
[null,"Tax clawbacks",{"$f":"'RFPR cover'!$C$14","v":"£m 09/10"},0,0,-5.7199081774133794E-17,5.5641081939546121E-17,4.3300387947228028E-16,0,0,0]
[null,"Net Tax Allowance",{"$f":"'RFPR cover'!$C$14","v":"£m 09/10"},{"$f":"SUM(D62:D63)","v":8.0038105903628463},10.465708460187001,29.25380393188227,27.846649888264462,25.886158840487187,23.653632178616633,23.662777768095424,20.344600557579394]
[]
[null,"Network operators should provide forecast allowances taking account of the latest totex, allowances, reopeners, enduring value adjustments - and other financial variables"]
[]
[null,"Forecast tax allowance",{"$f":"'RFPR cover'!$C$14","v":"£m 09/10"},7.2306943156242625,8.2910430578985412,25.1011439255368,25.270240815943367,23.749347972307039,23.394769014367949,22.256871619584558,24.006349841596641]
[null,"Forecast tax clawbacks",{"$f":"'RFPR cover'!$C$14","v":"£m 09/10"},0,0,-5.7199081774133794E-17,5.5641081939546121E-17,4.3300387947228028E-16,4.2812374411727792E-16,0,4.0793798462926742E-16]
[null,"Net forecast tax allowance",{"$f":"'RFPR cover'!$C$14","v":"£m 09/10"},{"$f":"SUM(D68:D69)","v":7.2306943156242625},8.2910430578985412,25.1011439255368,25.270240815943367,23.749347972307039,23.394769014367949,22.256871619584558,24.006349841596641]
[]
[null,"Reconciliation of forecast movement in allowance",null,{"$f":"D70-D64","v":-0.7731162747385838},-2.1746654022884595,-4.1526600063454708,-2.5764090723210948,-2.1368108681801488,-0.25886316424868383,-1.4059061485108657,3.6617492840172474]
[null,"Changes in corporation tax rates",{"$f":"'RFPR cover'!$C$14","v":"£m 09/10"},0,0,0,0,0,0,0,0]
[null,"Tax allowance retained within deadband",{"$f":"'RFPR cover'!$C$14","v":"£m 09/10"},0,0,0,0,0,0,0,0]
[null,"Other adjustments",{"$f":"'RFPR cover'!$C$14","v":"£m 09/10"},-0.7731162747385838,-2.1746654022884595,-4.1526600063454708,-2.5764090723210948,-2.1368108681801488,-0.25886316424868383,-1.4059061485108657,3.6617492840172474]
[null,"Check",{"$f":"'RFPR cover'!$C$14","v":"£m 09/10"},{"$f":"IF(ABS(D72-SUM(D73:D75))<'RFPR cover'!$F$14,\"OK\",\"ERROR\")","v":"OK"},{"$f":"IF(ABS(E72-SUM(E73:E75))<'RFPR cover'!$F$14,\"OK\",\"ERROR\")","v":"OK"},{"$f":"IF(ABS(F72-SUM(F73:F75))<'RFPR cover'!$F$14,\"OK\",\"ERROR\")","v":"OK"},{"$f":"IF(ABS(G72-SUM(G73:G75))<'RFPR cover'!$F$14,\"OK\",\"ERROR\")","v":"OK"},{"$f":"IF(ABS(H72-SUM(H73:H75))<'RFPR cover'!$F$14,\"OK\",\"ERROR\")","v":"OK"},{"$f":"IF(ABS(I72-SUM(I73:I75))<'RFPR cover'!$F$14,\"OK\",\"ERROR\")","v":"OK"},{"$f":"IF(ABS(J72-SUM(J73:J75))<'RFPR cover'!$F$14,\"OK\",\"ERROR\")","v":"OK"},{"$f":"IF(ABS(K72-SUM(K73:K75))<'RFPR cover'!$F$14,\"OK\",\"ERROR\")","v":"OK"}]
[]
[]
[null,"Out(under) performance"]
[]
[null,"Regulated tax out(under) performance at actual gearing",{"$f":"'RFPR cover'!$C$14","v":"£m 09/10"},{"$f":"D$70-D43","v":-6.0539691430238847},-8.258151954921253,-8.9680505599465157,-6.3578386610219901,-4.2609914041815031,-1.7959728871755622,-0.37376453620960248,0.50670046727595874]
[]
[null,"Regulated tax out(under) performance at notional gearing",{"$f":"'RFPR cover'!$C$14","v":"£m 09/10"},{"$f":"D$70-D55","v":-5.7586688500932635},-8.0709017322639909,-8.559415492866723,-6.2521368605978189,-4.296049578313049,-1.844985230836091,-0.69696760147739312,0.24741037934711585]
[]
[null,"Impact on out(under) performance relating to deviating from notional levels of gearing",{"$f":"'RFPR cover'!$C$14","v":"£m 09/10"},{"$f":"D81-D83","v":-0.29530029293062121},-0.1872502226572621,-0.40863506707979269,-0.10570180042417121,3.5058174131545883E-2,4.9012343660528757E-2,0.32320306526779063,0.25929008792884289]
[]
[null,"Tax impact of financing performance (at actual gearing)","£m nominal",-5.2743077145659214,-5.9118691111572579,-6.4306879234555971,-3.8422499436251307,-1.697193575371041,-0.64582880613913662,0.50980082167771057,0.57561526628879278]
[null,"Tax impact of financing performance (at actual gearing)",{"$f":"'RFPR cover'!$C$14","v":"£m 09/10"},{"$f":"D87/D$41","v":-4.5207483828053734},-4.9698101528714957,-5.3483182215841616,-3.128512345980873,-1.3320760624539241,-0.49186236892083213,0.37846627084500717,0.41771812485033372]
[null,"Tax impact of financing performance (at notional gearing)","£m nominal",-4.929784091211542,-5.6891244240699299,-5.939355044202923,-3.7124333752991028,-1.7418610756567858,-0.71018336016166028,7.444052424779013E-2,0.21831371739698557]
[null,"Tax impact of financing performance (at notional gearing)",{"$f":"'RFPR cover'!$C$14","v":"£m 09/10"},{"$f":"D89/D$41","v":-4.2254480898747513},-4.7825599302142336,-4.9396831545043698,-3.0228105455567014,-1.3671342365854675,-0.54087471258136366,5.5263205577215035E-2,0.15842803692149057]
[null,"Tax impact of financing performance relating to deviating from notional levels of gearing",{"$f":"'RFPR cover'!$C$14","v":"£m 09/10"},{"$f":"D88-D90","v":-0.2953002929306221},-0.1872502226572621,-0.4086350670797918,-0.10570180042417165,3.505817413154344E-2,4.9012343660531532E-2,0.32320306526779213,0.25929008792884312]

{"sheet":"R11 - Dividends","index":14,"n_rows":15,"n_cols":11,"rows_kept":15,"cut":false,"hidden":false,"merged":[]}
["R11 - Dividends "]
[{"$f":"'RFPR cover'!C5","v":"Cadent-London"}]
[{"$f":"'RFPR cover'!C7","v":2020},{"$f":"'R1 - RoRE'!B3","v":""}]
[]
[null,null,null,{"$f":"IF(D6<='RFPR cover'!$C$7,\"Actuals\",\"N/A\")","v":"Actuals"},{"$f":"IF(E6<='RFPR cover'!$C$7,\"Actuals\",\"N/A\")","v":"Actuals"},{"$f":"IF(F6<='RFPR cover'!$C$7,\"Actuals\",\"N/A\")","v":"Actuals"},{"$f":"IF(G6<='RFPR cover'!$C$7,\"Actuals\",\"N/A\")","v":"Actuals"},{"$f":"IF(H6<='RFPR cover'!$C$7,\"Actuals\",\"N/A\")","v":"Actuals"},{"$f":"IF(I6<='RFPR cover'!$C$7,\"Actuals\",\"N/A\")","v":"Actuals"},{"$f":"IF(J6<='RFPR cover'!$C$7,\"Actuals\",\"N/A\")","v":"Actuals"},{"$f":"IF(K6<='RFPR cover'!$C$7,\"Actuals\",\"N/A\")","v":"N/A"}]
[null,null,null,{"$f":"'RFPR cover'!$C$13","v":2014},{"$f":"D6+1","v":2015},2016,2017,2018,2019,2020,2021]
[]
[null,"Dividend paid as per Statutory Accounts","£m nominal",455,540,458,95,418,423,275]
[null,"Less dividend paid not related to Regulated business"]
[null,"Metering","£m nominal",65,97,67,0,0,0,0]
[null,"Non regulated activities","£m nominal",3,7,8,0,3,2.1217269146101785,1.1575187417002439]
[null,"Other networks (East of England, West Midlands and North West)","£m nominal",271,307,282,64,322,324.60045078877499,204.08156119895125]
[null,"Dividend paid relating to the Regulated Business","£m nominal",{"$f":"D8-SUM(D10:D12)","v":116},129,101,31,93,96.277822296614829,69.760920059348507,0]
[]
[null,"Shareholder loan interest (not included as Net Interest per Regulatory (RIIO-1) definition)","£m nominal",0,0,0,0,0,0,0]

{"sheet":"R12 - Pensions","index":15,"n_rows":39,"n_cols":11,"rows_kept":39,"cut":false,"hidden":false,"merged":[[20,3,22,3]]}
["R12 - Pensions"]
[{"$f":"'RFPR cover'!C5","v":"Cadent-London"}]
[{"$f":"'RFPR cover'!C7","v":2020}]
[]
[null,null,null,{"$f":"IF(D6<='RFPR cover'!$C$7,\"Actuals\",\"Forecast\")","v":"Actuals"},{"$f":"IF(E6<='RFPR cover'!$C$7,\"Actuals\",\"Forecast\")","v":"Actuals"},{"$f":"IF(F6<='RFPR cover'!$C$7,\"Actuals\",\"Forecast\")","v":"Actuals"},{"$f":"IF(G6<='RFPR cover'!$C$7,\"Actuals\",\"Forecast\")","v":"Actuals"},{"$f":"IF(H6<='RFPR cover'!$C$7,\"Actuals\",\"Forecast\")","v":"Actuals"},{"$f":"IF(I6<='RFPR cover'!$C$7,\"Actuals\",\"Forecast\")","v":"Actuals"},{"$f":"IF(J6<='RFPR cover'!$C$7,\"Actuals\",\"Forecast\")","v":"Actuals"},{"$f":"IF(K6<='RFPR cover'!$C$7,\"Actuals\",\"Forecast\")","v":"Forecast"}]
[null,null,null,{"$f":"'RFPR cover'!$C$13","v":2014},{"$f":"D6+1","v":2015},2016,2017,2018,2019,2020,2021]
[]
[null,"Licensee share of total pension deficit repair payment made for defined benefit scheme","£m nominal",1.8436334853921736,2.8744488807940529,2.880095675183568,3.0586038613649684,8.4171447825220014,8.6927146830946267,8.9354338128900146]
[null,"Of which:"]
[null,"Established deficit element funded via specific allowances","£m nominal",1.8436334853921736,2.8744488807940529,2.880095675183568,2.9699770269693868,8.1643782557814752,8.4316728030791257,8.6671030869538335]
[null,"Incremental deficit funded via totex","£m nominal",0,0,0,8.8626834395581763E-2,0.25276652674052702,0.26104188001550105,0.26833072593618168]
[]
[]
[null,"Established deficit element funded via specific allowances",{"$f":"'RFPR cover'!$C$14","v":"£m 09/10"},{"$f":"D10/Data!C$34","v":1.5802269318786695},{"$f":"E10/Data!D$34","v":2.4164041799775213},{"$f":"F10/Data!E$34","v":2.3953375381980431},{"$f":"G10/Data!F$34","v":2.4182731296722304},{"$f":"H10/Data!G$34","v":6.4079743154626332},{"$f":"I10/Data!H$34","v":6.4215509117355456},{"$f":"J10/Data!I$34","v":6.4342897164304116},{"$f":"K10/Data!J$34","v":0}]
[]
[]
[null,"Established deficit (EDE) allowance as per PCFM",{"$f":"'RFPR cover'!$C$14","v":"£m 09/10"},3,3,2.4,2.4,2.4,6.1,6.1471544919039642,6.1471544919039642]
[null,"Less Pension Payment History Allowance (PPH)",{"$f":"'RFPR cover'!$C$14","v":"£m 09/10"},0,0,0,0,0,-0.3,-0.3,-0.3]
[null,"Established deficit allowance less PPH",{"$f":"'RFPR cover'!$C$14","v":"£m 09/10"},{"$f":"D17-D18","v":3},3,2.4,2.4,2.4,6.3999999999999995,6.4471544919039641,6.4471544919039641]
[]
[null,null,null,"Enter valuation date"]
[]
[]
[null,"Latest pension scheme valuation",null,"2016-03-31"]
[]
[null,"Price base",null,42460]
[]
[null,null,null,"£m"]
[null,"Total Liabilities attributable to post cut-off date notional sub fund",null,120.58613549790965]
[null,"Total Liabilities attributable to pre cut-off date notional sub fund",null,18243.313864502092]
[]
[null,"Total Assets attributable to post cut-off date notional sub fund",null,103.9]
[null,"Total Assets attributable to pre cut-off date notional sub fund",null,16725.7]
[]
[null,"Deficit in the post Cut-Off Date Notional Sub-Fund",null,{"$f":"D29-D32","v":16.686135497909646}]
[null,"Deficit in the pre Cut-Off Date Notional Sub-Fund",null,{"$f":"D30-D33","v":1517.613864502091}]
[]
[null,"Licensee element of established deficit",null,45.033334915605117]
[null,"Licensee element of incremental deficit",null,3.5603785637458105]

{"sheet":"R13 - Other Activities","index":16,"n_rows":21,"n_cols":15,"rows_kept":21,"cut":false,"hidden":false,"merged":[]}
["R13 - Other activities",null,null,null,null,null,null,null,null,null,null,null,null,null," "]
[{"$f":"'RFPR cover'!C5","v":"Cadent-London"},null,null,null,null,null,null,null,null,null,null,null,null,null," "]
[{"$f":"'RFPR cover'!C7","v":2020},null,null,null,null,null,null,null,null,null,null,null,null,null," "]
[null,null,null,null,null,null,null,null,null,null,null,null,null,null," "]
[null,null,null,{"$f":"IF(D6<='RFPR cover'!$C$7,\"Actuals\",\"Forecast\")","v":"Actuals"},{"$f":"IF(E6<='RFPR cover'!$C$7,\"Actuals\",\"Forecast\")","v":"Actuals"},{"$f":"IF(F6<='RFPR cover'!$C$7,\"Actuals\",\"Forecast\")","v":"Actuals"},{"$f":"IF(G6<='RFPR cover'!$C$7,\"Actuals\",\"Forecast\")","v":"Actuals"},{"$f":"IF(H6<='RFPR cover'!$C$7,\"Actuals\",\"Forecast\")","v":"Actuals"},{"$f":"IF(I6<='RFPR cover'!$C$7,\"Actuals\",\"Forecast\")","v":"Actuals"},{"$f":"IF(J6<='RFPR cover'!$C$7,\"Actuals\",\"Forecast\")","v":"Actuals"},{"$f":"IF(K6<='RFPR cover'!$C$7,\"Actuals\",\"Forecast\")","v":"Forecast"},null,null,null," "]
[null,null,null,{"$f":"'RFPR cover'!$C$13","v":2014},{"$f":"D6+1","v":2015},2016,2017,2018,2019,2020,2021]
[]
[null,"Post-tax total fines and penalties (including GS payments)",{"$f":"'RFPR cover'!$C$14","v":"£m 09/10"},{"$f":"(D16+D21)/Data!C34","v":0.99205321998561824},{"$f":"(E16+E21)/Data!D34","v":1.2159193821630663},{"$f":"(F16+F21)/Data!E34","v":1.1147712136232353},{"$f":"(G16+G21)/Data!F34","v":0.85290935495492393},{"$f":"(H16+H21)/Data!G34","v":1.0879580033548319},{"$f":"(I16+I21)/Data!H34","v":7.314591576100022},{"$f":"(J16+J21)/Data!I34","v":2.0235075041899555},{"$f":"(K16+K21)/Data!J34","v":1.4770142074038952}]
[]
[null,"Ofgem related fines and penalties"]
[null,"Failure to meet gas network repair targets","£m nominal",0.375,0.375,0,0,0,0,0,0]
[null,"Fine/penalty","£m nominal",0,0,0,0,0,8.141,0,0]
[null,"Payments to residents who faced delayed compensation","£m nominal",0,0,0,0,0,0,0,0]
[null,"Total Ofgem related fines and penalties","£m nominal",{"$f":"SUM(D11:D13)","v":0.375},0.375,0,0,0,8.141,0,0]
[null,"Any adjustment for tax","£m nominal",0,0,0,0,0,0,0,0]
[null,"Post-tax total fines and penalties","£m nominal",{"$f":"D14-D15","v":0.375},0.375,0,0,0,8.141,0,0]
[]
[null,"Guaranteed Standard (GS) payments"]
[null,"Total GS payments","£m nominal",1.0161268129999999,1.3562083469999999,1.6754672879999999,1.3093647070000001,1.7113130710000002,1.8064935,3.3650626217499999,2.5127462747364224]
[null,"Any adjustment for tax","£m nominal",0.23370916698999997,0.28480375286999998,0.33509345759999998,0.2618729414,0.32514948349000006,0.34323376500000002,0.6393618981325,0.47742179219992026]
[null,"Post-tax total GS payments","£m nominal",{"$f":"D19-D20","v":0.78241764600999986},1.0714045941299999,1.3403738303999999,1.0474917656,1.38616358751,1.4632597349999998,2.7257007236174999,2.035324482536502]