{"text_format":"1","workbook":"xlsx","n_sheets":17,"sheets":["RFPR cover","Data","Content & Version Control","Change log","R1 - RoRE","R2 - Revenue","R3 - Rec to totex","R4 - Totex","R5 - Output Incentives","R6 - Innovation","R7 - Financing","R8 - Net Debt","R9 - RAV","R10 - Tax","R11 - Dividends","R12 - Pensions","R13 - Other Activities"],"not_rendered":{"charts":0,"images":1,"macros":0,"external_links":6,"defined_names":359,"comments":0,"pivot_tables":0},"unopened":[],"bounds":{"document_bytes":16777216,"sheet_cells":100000,"rows_first":2000,"rows_last":500,"rows_between":2000,"halvings":0,"cell_chars":16384,"cell_head_chars":4096},"cells_cut":0,"cells_raw":0,"read":"whole","date_system":"1900"}

{"sheet":"RFPR cover","index":0,"n_rows":14,"n_cols":7,"rows_kept":14,"cut":false,"hidden":false,"merged":[]}
["Regulatory Financial Performance Report"]
[{"$f":"'RFPR cover'!C5","v":"Cadent-NW"}]
[{"$f":"'RFPR cover'!C7","v":2021}]
[]
[null,"Licensee","Cadent-NW",null,null,null,"Input cells"]
[null,"Sector",{"$f":"INDEX(Data!$A$73:$A$100,MATCH($C$5,Data!$B$73:$B$100,0),0)&\"1\"","v":"GD1"},null,null,null,"Totals cells (of formula within worksheet)"]
[null,"Reporting Year:\n(enter 2014 for 2013-14)",2021,null,null,null,"Referencing to other worksheets"]
[null,"Version (Number)",null,null,null,null,"Referencing to other workbooks"]
[null,"Submitted Date:","2021-07-30",null,null,null,"Check cells"]
[null,"Cost of Equity",{"$f":"SUMIF(Data!$B$72:$B$100,C5,Data!$C$72:$C$100)","v":6.7000000000000004E-2},null,null,null,"No Input"]
{"$rows_left_out":5}
{"sheet":"Data","index":1,"n_rows":267,"n_cols":20,"rows_kept":267,"cut":false,"hidden":false,"merged":[[208,1,208,2],[208,4,208,8],[211,1,211,3],[205,1,205,2],[205,4,205,8],[206,1,206,2],[206,4,206,8],[207,1,207,2],[207,4,207,8],[202,1,202,2],[202,4,202,8],[203,1,203,2],[203,4,203,8],[204,1,204,2],[204,4,204,8],[197,1,197,2],[197,4,197,8],[198,1,198,2],[198,4,198,8],[201,1,201,2],[201,4,201,8],[194,1,194,2],[194,4,194,8],[195,1,195,2],[195,4,195,8],[196,1,196,2],[196,4,196,8],[191,1,191,2],[191,4,191,8],[192,1,192,2],[192,4,192,8],[193,1,193,2],[193,4,193,8],[186,1,186,2],[186,4,186,8],[187,1,187,2],[187,4,187,8],[188,1,188,2],[188,4,188,8],[183,1,183,2],[183,4,183,8],[184,1,184,2],[184,4,184,8],[185,1,185,2],[185,4,185,8],[182,1,182,2],[182,4,182,8],[168,1,168,2],[171,1,171,2],[172,1,172,2],[173,1,173,2],[174,1,174,2],[175,1,175,2],[176,1,176,2],[177,1,177,2],[178,1,178,2],[181,1,181,2],[181,4,181,8],[167,1,167,2],[55,6,55,8],[55,9,55,10],[56,6,56,8],[56,9,56,10],[70,10,70,19],[161,1,161,2],[162,1,162,2],[163,1,163,2],[164,1,164,2],[165,1,165,2],[166,1,166,2],[37,10,37,12],[38,10,38,12],[53,6,53,8],[53,9,53,10],[54,6,54,8],[54,9,54,10]]}
["Network Operator Data"]
[{"$f":"'RFPR cover'!C5","v":"Cadent-NW"}]
[{"$f":"'RFPR cover'!C7","v":2021}]
[]
[]
[null,2018,"2017-18"]
[null,2019,"2018-19"]
[null,2020,"2019-20"]
[null,2021,"2020-21"]
[null,2022,"2021-22"]
{"$rows_left_out":258}
{"sheet":"Content & Version Control","index":2,"n_rows":35,"n_cols":9,"rows_kept":35,"cut":false,"hidden":false,"merged":[[13,3,13,7],[14,3,14,7],[15,3,15,7],[16,3,16,7],[17,3,17,7],[12,3,12,7],[7,3,7,7],[8,3,8,7],[9,3,9,7],[10,3,10,7],[11,3,11,7]]}
["Version control",null,null,null,null,null,null,null," "]
[{"$f":"'RFPR cover'!C5","v":"Cadent-NW"}]
[{"$f":"'RFPR cover'!C7","v":2021}]
[]
[]
[null,"Version:"]
[]
[null,"Submission","Date submitted","Changes"]
[null,"Submission 1"]
[null,"Submission 2"]
{"$rows_left_out":26}
{"sheet":"Change log","index":3,"n_rows":35,"n_cols":3,"rows_kept":35,"cut":false,"hidden":false,"merged":[]}
["Change log"]
[{"$f":"'RFPR cover'!C5","v":"Cadent-NW"}]
[{"$f":"'RFPR cover'!C7","v":2021}]
[]
["Version","Table Reference","Changes made to RFPR template"]
[1.1000000000000001,"R8","Row 26 added to pick up unamortised issues costs row in table R8a."]
[1.1000000000000001,"R8","Row 42 updated to include new row 26 (unamortised issue costs) in the subtotal"]
[1.1000000000000001,"R1","Amended formating to percentages (Column M:N, rows 10-23 and rows 29-42)"]
[1.1000000000000001,"R7","B29 to add \"Net Interest\" into the title to make it clear that this should include regulatory definition of net interest associated with new/refinanced debt raised in future years"]
[1.1000000000000001,"R7","Row 47 added to allow input of issuance expenses forecast for new/refinanced debt in future years"]
{"$rows_left_out":26}
{"sheet":"R1 - RoRE","index":4,"n_rows":66,"n_cols":15,"rows_kept":66,"cut":false,"hidden":false,"merged":[]}
["R1 - Return on Regulatory Equity (RoRE)",null,null,null,null,null,null,null,null,null,null,null,null,null," "]
[{"$f":"'RFPR cover'!C5","v":"Cadent-NW"}]
[{"$f":"'RFPR cover'!C7","v":2021},{"$f":"IF('RFPR cover'!C5=Data!B98,\"Not required to be completed for System Operator\",(IF('RFPR cover'!C5=Data!B96,\"Not required to be completed for System Operator\",\"\")))","v":""}]
[]
[null,null,null,{"$f":"IF(D6<='RFPR cover'!$C$7,\"Actuals\",\"Forecast\")","v":"Actuals"},{"$f":"IF(E6<='RFPR cover'!$C$7,\"Actuals\",\"Forecast\")","v":"Actuals"},{"$f":"IF(F6<='RFPR cover'!$C$7,\"Actuals\",\"Forecast\")","v":"Actuals"},{"$f":"IF(G6<='RFPR cover'!$C$7,\"Actuals\",\"Forecast\")","v":"Actuals"},{"$f":"IF(H6<='RFPR cover'!$C$7,\"Actuals\",\"Forecast\")","v":"Actuals"},{"$f":"IF(I6<='RFPR cover'!$C$7,\"Actuals\",\"Forecast\")","v":"Actuals"},{"$f":"IF(J6<='RFPR cover'!$C$7,\"Actuals\",\"Forecast\")","v":"Actuals"},{"$f":"IF(K6<='RFPR cover'!$C$7,\"Actuals\",\"Forecast\")","v":"Actuals"}]
[null,null,null,{"$f":"'RFPR cover'!$C$13","v":2014},{"$f":"D6+1","v":2015},{"$f":"E6+1","v":2016},2017,2018,2019,2020,2021,null,{"$f":"\"Cumulative to \"&'RFPR cover'!$C$7","v":"Cumulative to 2021"},"RIIO-1 period"]
[]
[null,"RoRE based on Notional Gearing"]
[]
[null,"Allowed Equity Return","%",{"$f":"D48/D$65","v":6.7000000000000004E-2},6.7000000000000004E-2,6.7000000000000004E-2,6.7000000000000004E-2,6.7000000000000004E-2,6.7000000000000004E-2,6.7000000000000004E-2,6.7000000000000004E-2,null,{"$f":"AVERAGE(D48:INDEX(D48:K48,0,MATCH('RFPR cover'!$C$7,$D$6:$K$6,0)))/AVERAGE($D$65:INDEX($D$65:$K$65,0,MATCH('RFPR cover'!$C$7,$D$6:$K$6,0)))","v":6.7000000000000004E-2},{"$f":"AVERAGE(D48:K48)/AVERAGE($D$65:$K$65)","v":6.7000000000000004E-2}]
{"$rows_left_out":57}
{"sheet":"R2 - Revenue","index":5,"n_rows":68,"n_cols":11,"rows_kept":68,"cut":false,"hidden":false,"merged":[]}
["R2 - Revenue"]
[{"$f":"'RFPR cover'!C5","v":"Cadent-NW"}]
[{"$f":"'RFPR cover'!C7","v":2021}]
[]
[null,null,null,{"$f":"IF(D6<='RFPR cover'!$C$7,\"Actuals\",\"Forecast\")","v":"Actuals"},{"$f":"IF(E6<='RFPR cover'!$C$7,\"Actuals\",\"Forecast\")","v":"Actuals"},{"$f":"IF(F6<='RFPR cover'!$C$7,\"Actuals\",\"Forecast\")","v":"Actuals"},{"$f":"IF(G6<='RFPR cover'!$C$7,\"Actuals\",\"Forecast\")","v":"Actuals"},{"$f":"IF(H6<='RFPR cover'!$C$7,\"Actuals\",\"Forecast\")","v":"Actuals"},{"$f":"IF(I6<='RFPR cover'!$C$7,\"Actuals\",\"Forecast\")","v":"Actuals"},{"$f":"IF(J6<='RFPR cover'!$C$7,\"Actuals\",\"Forecast\")","v":"Actuals"},{"$f":"IF(K6<='RFPR cover'!$C$7,\"Actuals\",\"Forecast\")","v":"Actuals"}]
[null,null,null,{"$f":"'RFPR cover'!$C$13","v":2014},{"$f":"D6+1","v":2015},{"$f":"E6+1","v":2016},2017,2018,2019,2020,2021]
[]
[null,"Allowed Revenue - per latest submitted Revenue Return"]
[]
[null,"Opening Base Revenue Allowance",{"$f":"'RFPR cover'!$C$14","v":"£m 09/10"},381.7,364.7,367.6,361.4,363.1,361.6,361.3,360.6]
{"$rows_left_out":59}
{"sheet":"R3 - Rec to totex","index":6,"n_rows":97,"n_cols":11,"rows_kept":97,"cut":false,"hidden":false,"merged":[]}
["R3 - Reconciliation to totex"]
[{"$f":"'RFPR cover'!C5","v":"Cadent-NW"}]
[{"$f":"'RFPR cover'!C7","v":2021}]
[]
[null,null,null,{"$f":"IF(D6<='RFPR cover'!$C$7,\"Actuals\",\"N/A\")","v":"Actuals"},{"$f":"IF(E6<='RFPR cover'!$C$7,\"Actuals\",\"N/A\")","v":"Actuals"},{"$f":"IF(F6<='RFPR cover'!$C$7,\"Actuals\",\"N/A\")","v":"Actuals"},{"$f":"IF(G6<='RFPR cover'!$C$7,\"Actuals\",\"N/A\")","v":"Actuals"},{"$f":"IF(H6<='RFPR cover'!$C$7,\"Actuals\",\"N/A\")","v":"Actuals"},{"$f":"IF(I6<='RFPR cover'!$C$7,\"Actuals\",\"N/A\")","v":"Actuals"},{"$f":"IF(J6<='RFPR cover'!$C$7,\"Actuals\",\"N/A\")","v":"Actuals"},{"$f":"IF(K6<='RFPR cover'!$C$7,\"Actuals\",\"N/A\")","v":"Actuals"}]
[null,null,null,{"$f":"'RFPR cover'!$C$13","v":2014},{"$f":"D6+1","v":2015},{"$f":"E6+1","v":2016},2017,2018,2019,2020,2021]
[]
[null,"Total Expenditure Per Accounts"]
[null,"Tangible Fixed Asset Additions","£m nominal",509,520,581,549,610,706,815,995]
[null,"Intangible Asset Additions (under IFRS) - IT Software","£m nominal",35,40,24,11,2,30,46,34]
{"$rows_left_out":88}
{"sheet":"R4 - Totex","index":7,"n_rows":149,"n_cols":14,"rows_kept":149,"cut":false,"hidden":false,"merged":[[13,14,13,16],[41,14,41,16],[91,14,91,16],[119,14,119,16]]}
["R4 - Totex"]
[{"$f":"'RFPR cover'!C5","v":"Cadent-NW"}]
[{"$f":"'RFPR cover'!C7","v":2021}]
[]
[null,null,null,{"$f":"IF(D6<='RFPR cover'!$C$7,\"Actuals\",\"Forecast\")","v":"Actuals"},{"$f":"IF(E6<='RFPR cover'!$C$7,\"Actuals\",\"Forecast\")","v":"Actuals"},{"$f":"IF(F6<='RFPR cover'!$C$7,\"Actuals\",\"Forecast\")","v":"Actuals"},{"$f":"IF(G6<='RFPR cover'!$C$7,\"Actuals\",\"Forecast\")","v":"Actuals"},{"$f":"IF(H6<='RFPR cover'!$C$7,\"Actuals\",\"Forecast\")","v":"Actuals"},{"$f":"IF(I6<='RFPR cover'!$C$7,\"Actuals\",\"Forecast\")","v":"Actuals"},{"$f":"IF(J6<='RFPR cover'!$C$7,\"Actuals\",\"Forecast\")","v":"Actuals"},{"$f":"IF(K6<='RFPR cover'!$C$7,\"Actuals\",\"Forecast\")","v":"Actuals"}]
[null,null,null,{"$f":"'RFPR cover'!$C$13","v":2014},{"$f":"D6+1","v":2015},{"$f":"E6+1","v":2016},2017,2018,2019,2020,2021,{"$f":"\"Cumulative to \"&'RFPR cover'!$C$7","v":"Cumulative to 2021"},"RIIO-1 period","Enduring Value Appendix in Commentary"]
[]
[null,"Totex per the latest RRP submission"]
[]
[null,{"$f":"Data!B48","v":"Totex excluding repex"}]
{"$rows_left_out":140}
{"sheet":"R5 - Output Incentives","index":8,"n_rows":111,"n_cols":13,"rows_kept":111,"cut":false,"hidden":false,"merged":[[110,1,110,12],[20,1,20,12],[21,1,21,12],[22,1,22,12],[23,1,23,12],[24,1,24,12],[104,1,104,12],[105,1,105,12],[106,1,106,12],[107,1,107,12],[108,1,108,12],[109,1,109,12]]}
["R5 - Output Incentives"]
[{"$f":"'RFPR cover'!C5","v":"Cadent-NW"}]
[{"$f":"'RFPR cover'!C7","v":2021}]
[]
[null,null,null,{"$f":"IF(D6<='RFPR cover'!$C$7,\"Actuals\",\"Forecast\")","v":"Actuals"},{"$f":"IF(E6<='RFPR cover'!$C$7,\"Actuals\",\"Forecast\")","v":"Actuals"},{"$f":"IF(F6<='RFPR cover'!$C$7,\"Actuals\",\"Forecast\")","v":"Actuals"},{"$f":"IF(G6<='RFPR cover'!$C$7,\"Actuals\",\"Forecast\")","v":"Actuals"},{"$f":"IF(H6<='RFPR cover'!$C$7,\"Actuals\",\"Forecast\")","v":"Actuals"},{"$f":"IF(I6<='RFPR cover'!$C$7,\"Actuals\",\"Forecast\")","v":"Actuals"},{"$f":"IF(J6<='RFPR cover'!$C$7,\"Actuals\",\"Forecast\")","v":"Actuals"},{"$f":"IF(K6<='RFPR cover'!$C$7,\"Actuals\",\"Forecast\")","v":"Actuals"}]
[null,null,null,{"$f":"'RFPR cover'!$C$13","v":2014},{"$f":"D6+1","v":2015},{"$f":"E6+1","v":2016},2017,2018,2019,2020,2021,{"$f":"\"Cumulative to \"&'RFPR cover'!$C$7","v":"Cumulative to 2021"},"RIIO-1 period"]
[]
[null,"Pre-tax Earned Incentives (Actuals may be updated once all incentives are determined)"]
[null,"These values exclude any inflation, interest or time value of money adjustments"]
[]
{"$rows_left_out":102}
{"sheet":"R6 - Innovation","index":9,"n_rows":28,"n_cols":11,"rows_kept":28,"cut":false,"hidden":false,"merged":[]}
["R6 - Innovation"]
[{"$f":"'RFPR cover'!C5","v":"Cadent-NW"}]
[{"$f":"'RFPR cover'!C7","v":2021},{"$f":"'R1 - RoRE'!B3","v":""}]
[]
[null,null,null,{"$f":"IF(D6<='RFPR cover'!$C$7,\"Actuals\",\"Forecast\")","v":"Actuals"},{"$f":"IF(E6<='RFPR cover'!$C$7,\"Actuals\",\"Forecast\")","v":"Actuals"},{"$f":"IF(F6<='RFPR cover'!$C$7,\"Actuals\",\"Forecast\")","v":"Actuals"},{"$f":"IF(G6<='RFPR cover'!$C$7,\"Actuals\",\"Forecast\")","v":"Actuals"},{"$f":"IF(H6<='RFPR cover'!$C$7,\"Actuals\",\"Forecast\")","v":"Actuals"},{"$f":"IF(I6<='RFPR cover'!$C$7,\"Actuals\",\"Forecast\")","v":"Actuals"},{"$f":"IF(J6<='RFPR cover'!$C$7,\"Actuals\",\"Forecast\")","v":"Actuals"},{"$f":"IF(K6<='RFPR cover'!$C$7,\"Actuals\",\"Forecast\")","v":"Actuals"}]
[null,null,null,{"$f":"'RFPR cover'!$C$13","v":2014},{"$f":"D6+1","v":2015},{"$f":"E6+1","v":2016},2017,2018,2019,2020,2021]
[]
[null,"Network Innovation Allowance"]
[null,"Eligible NIA expenditure and Bid Preparation costs","£m nominal",0.69832304000000001,1.8774975700000001,2.3450738699999998,1.87,1.8011426399999999,1.1921696770000001,1.4925376769509044,1.93]
[null,"Unrecoverable Expenditure (eg not conforming to technical requirements)","£m nominal",0,0,0,0,0,0,0,0]
{"$rows_left_out":19}
{"sheet":"R7 - Financing","index":10,"n_rows":92,"n_cols":13,"rows_kept":92,"cut":false,"hidden":false,"merged":[]}
["R7 - Financing"]
[{"$f":"'RFPR cover'!C5","v":"Cadent-NW"}]
[{"$f":"'RFPR cover'!C7","v":2021},{"$f":"'R1 - RoRE'!B3","v":""}]
[]
[null,null,null,"Actuals","Actuals","Actuals","Actuals","Actuals","Actuals","Actuals","Actuals"]
[null,null,null,{"$f":"'RFPR cover'!$C$13","v":2014},{"$f":"D6+1","v":2015},{"$f":"E6+1","v":2016},2017,2018,2019,2020,2021,{"$f":"\"Cumulative to \"&'RFPR cover'!$C$7","v":"Cumulative to 2021"},"RIIO-1 period"]
[]
[null,"Net Interest Per Statutory Accounts","£m nominal",190,202,157,1009.9592004289094,144.53190509998873,146.48709870298899,158.52901547018013,124.19335514967814]
[]
[null,"Reconciliation with Statutory Accounts"]
{"$rows_left_out":83}
{"sheet":"R8 - Net Debt","index":11,"n_rows":66,"n_cols":11,"rows_kept":66,"cut":false,"hidden":false,"merged":[]}
["R8 - Net Debt"]
[{"$f":"'RFPR cover'!C5","v":"Cadent-NW"}]
[{"$f":"'RFPR cover'!C7","v":2021},{"$f":"'R1 - RoRE'!B3","v":""}]
[]
[null,null,null,"Actuals","Actuals","Actuals","Actuals","Actuals","Actuals","Actuals","Actuals"]
[null,null,null,{"$f":"'RFPR cover'!$C$13","v":2014},{"$f":"D6+1","v":2015},{"$f":"E6+1","v":2016},2017,2018,2019,2020,2021]
[]
[null,"Opening Cash, short term deposits and overdrafts (per Balance Sheet)","£m nominal",-513,{"$f":"D10","v":-257.707345971564},{"$f":"E10","v":-230.1982394366197},-67.950899195456699,-38.999085041106376,-164.53,-328.34,-335.7]
[]
[null,"Closing Cash, short term deposits and overdrafts (per Balance Sheet)","£m nominal",-257.707345971564,-230.1982394366197,-67.950899195456699,-38.999085041106376,-164.53,-328.34,-335.7,-826.13110988999938]
{"$rows_left_out":57}
{"sheet":"R9 - RAV","index":12,"n_rows":59,"n_cols":11,"rows_kept":59,"cut":false,"hidden":false,"merged":[]}
["R9 - Regulatory Asset Value (RAV)"]
[{"$f":"'RFPR cover'!C5","v":"Cadent-NW"}]
[{"$f":"'RFPR cover'!C7","v":2021}]
[]
[null,null,null,{"$f":"IF(D6<='RFPR cover'!$C$7-1,\"Actuals\",\"Forecast\")","v":"Actuals"},{"$f":"IF(E6<='RFPR cover'!$C$7-1,\"Actuals\",\"Forecast\")","v":"Actuals"},{"$f":"IF(F6<='RFPR cover'!$C$7-1,\"Actuals\",\"Forecast\")","v":"Actuals"},{"$f":"IF(G6<='RFPR cover'!$C$7-1,\"Actuals\",\"Forecast\")","v":"Actuals"},{"$f":"IF(H6<='RFPR cover'!$C$7-1,\"Actuals\",\"Forecast\")","v":"Actuals"},{"$f":"IF(I6<='RFPR cover'!$C$7-1,\"Actuals\",\"Forecast\")","v":"Actuals"},{"$f":"IF(J6<='RFPR cover'!$C$7-1,\"Actuals\",\"Forecast\")","v":"Actuals"},{"$f":"IF(K6<='RFPR cover'!$C$7-1,\"Actuals\",\"Forecast\")","v":"Forecast"}]
[null,null,null,{"$f":"'RFPR cover'!$C$13","v":2014},{"$f":"D6+1","v":2015},{"$f":"E6+1","v":2016},2017,2018,2019,2020,2021]
[]
[null,"RAV per latest published PCFM"]
[null,"The latest published PCFM does not account for the impact of the reporting years totex. This will be published in the forthcoming annual iteration process."]
[]
{"$rows_left_out":50}
{"sheet":"R10 - Tax","index":13,"n_rows":92,"n_cols":11,"rows_kept":92,"cut":false,"hidden":false,"merged":[]}
["R10 - Tax"]
[{"$f":"'RFPR cover'!C5","v":"Cadent-NW"}]
[{"$f":"'RFPR cover'!C7","v":2021}]
[]
[null,null,null,{"$f":"IF(D6<=('RFPR cover'!$C$7-1),\"Actuals\",\"Forecast\")","v":"Actuals"},{"$f":"IF(E6<=('RFPR cover'!$C$7-1),\"Actuals\",\"Forecast\")","v":"Actuals"},{"$f":"IF(F6<=('RFPR cover'!$C$7-1),\"Actuals\",\"Forecast\")","v":"Actuals"},{"$f":"IF(G6<=('RFPR cover'!$C$7-1),\"Actuals\",\"Forecast\")","v":"Actuals"},{"$f":"IF(H6<=('RFPR cover'!$C$7-1),\"Actuals\",\"Forecast\")","v":"Actuals"},{"$f":"IF(I6<=('RFPR cover'!$C$7-1),\"Actuals\",\"Forecast\")","v":"Actuals"},{"$f":"IF(J6<=('RFPR cover'!$C$7-1),\"Actuals\",\"Forecast\")","v":"Actuals"},{"$f":"IF(K6<=('RFPR cover'!$C$7-1),\"Actuals\",\"Forecast\")","v":"Forecast"}]
[null,null,null,{"$f":"'RFPR cover'!$C$13","v":2014},{"$f":"D6+1","v":2015},{"$f":"E6+1","v":2016},2017,2018,2019,2020,2021]
[]
[null,"CT600 will not have been submitted for the current reporting year."]
[null,"It is assumed the current tax charge per the statutory accounts will equal the tax liability in the forthcoming CT600, where this is not the case the licensee should provide an explanation in the commentary of the variance."]
[null,"This will be corrected / trued-up in future years"]
{"$rows_left_out":83}
{"sheet":"R11 - Dividends","index":14,"n_rows":15,"n_cols":11,"rows_kept":15,"cut":false,"hidden":false,"merged":[]}
["R11 - Dividends "]
[{"$f":"'RFPR cover'!C5","v":"Cadent-NW"}]
[{"$f":"'RFPR cover'!C7","v":2021},{"$f":"'R1 - RoRE'!B3","v":""}]
[]
[null,null,null,{"$f":"IF(D6<='RFPR cover'!$C$7,\"Actuals\",\"N/A\")","v":"Actuals"},{"$f":"IF(E6<='RFPR cover'!$C$7,\"Actuals\",\"N/A\")","v":"Actuals"},{"$f":"IF(F6<='RFPR cover'!$C$7,\"Actuals\",\"N/A\")","v":"Actuals"},{"$f":"IF(G6<='RFPR cover'!$C$7,\"Actuals\",\"N/A\")","v":"Actuals"},{"$f":"IF(H6<='RFPR cover'!$C$7,\"Actuals\",\"N/A\")","v":"Actuals"},{"$f":"IF(I6<='RFPR cover'!$C$7,\"Actuals\",\"N/A\")","v":"Actuals"},{"$f":"IF(J6<='RFPR cover'!$C$7,\"Actuals\",\"N/A\")","v":"Actuals"},{"$f":"IF(K6<='RFPR cover'!$C$7,\"Actuals\",\"N/A\")","v":"Actuals"}]
[null,null,null,{"$f":"'RFPR cover'!$C$13","v":2014},{"$f":"D6+1","v":2015},{"$f":"E6+1","v":2016},2017,2018,2019,2020,2021]
[]
[null,"Dividend paid as per Statutory Accounts","£m nominal",455,540,458,95,418,423,275,0]
[null,"Less dividend paid not related to Regulated business"]
[null,"Metering","£m nominal",65,97,67,"              -  ","              -  ",0,0,0]
{"$rows_left_out":6}
{"sheet":"R12 - Pensions","index":15,"n_rows":39,"n_cols":11,"rows_kept":39,"cut":false,"hidden":false,"merged":[[20,3,22,3]]}
["R12 - Pensions"]
[{"$f":"'RFPR cover'!C5","v":"Cadent-NW"}]
[{"$f":"'RFPR cover'!C7","v":2021}]
[]
[null,null,null,{"$f":"IF(D6<='RFPR cover'!$C$7,\"Actuals\",\"Forecast\")","v":"Actuals"},{"$f":"IF(E6<='RFPR cover'!$C$7,\"Actuals\",\"Forecast\")","v":"Actuals"},{"$f":"IF(F6<='RFPR cover'!$C$7,\"Actuals\",\"Forecast\")","v":"Actuals"},{"$f":"IF(G6<='RFPR cover'!$C$7,\"Actuals\",\"Forecast\")","v":"Actuals"},{"$f":"IF(H6<='RFPR cover'!$C$7,\"Actuals\",\"Forecast\")","v":"Actuals"},{"$f":"IF(I6<='RFPR cover'!$C$7,\"Actuals\",\"Forecast\")","v":"Actuals"},{"$f":"IF(J6<='RFPR cover'!$C$7,\"Actuals\",\"Forecast\")","v":"Actuals"},{"$f":"IF(K6<='RFPR cover'!$C$7,\"Actuals\",\"Forecast\")","v":"Actuals"}]
[null,null,null,{"$f":"'RFPR cover'!$C$13","v":2014},{"$f":"D6+1","v":2015},{"$f":"E6+1","v":2016},2017,2018,2019,2020,2021]
[]
[null,"Licensee share of total pension deficit repair payment made for defined benefit scheme","£m nominal",2.0549690787007635,3.2039467796286472,3.2102408657125614,3.4303785434178593,9.7110505194328489,10.028981753270317,10.309012309043833,0.20089054552328839]
[null,"Of which:"]
[null,"Established deficit element funded via specific allowances","£m nominal",2.0549690787007635,3.2039467796286472,3.2102408657125614,3.3287661980126679,9.4212489057659461,9.7296922902284333,10.001366046006233,0.2769865370595383]
{"$rows_left_out":30}
{"sheet":"R13 - Other Activities","index":16,"n_rows":21,"n_cols":15,"rows_kept":21,"cut":false,"hidden":false,"merged":[]}
["R13 - Other activities",null,null,null,null,null,null,null,null,null,null,null,null,null," "]
[{"$f":"'RFPR cover'!C5","v":"Cadent-NW"},null,null,null,null,null,null,null,null,null,null,null,null,null," "]
[{"$f":"'RFPR cover'!C7","v":2021},null,null,null,null,null,null,null,null,null,null,null,null,null," "]
[null,null,null,null,null,null,null,null,null,null,null,null,null,null," "]
[null,null,null,{"$f":"IF(D6<='RFPR cover'!$C$7,\"Actuals\",\"Forecast\")","v":"Actuals"},{"$f":"IF(E6<='RFPR cover'!$C$7,\"Actuals\",\"Forecast\")","v":"Actuals"},{"$f":"IF(F6<='RFPR cover'!$C$7,\"Actuals\",\"Forecast\")","v":"Actuals"},{"$f":"IF(G6<='RFPR cover'!$C$7,\"Actuals\",\"Forecast\")","v":"Actuals"},{"$f":"IF(H6<='RFPR cover'!$C$7,\"Actuals\",\"Forecast\")","v":"Actuals"},{"$f":"IF(I6<='RFPR cover'!$C$7,\"Actuals\",\"Forecast\")","v":"Actuals"},{"$f":"IF(J6<='RFPR cover'!$C$7,\"Actuals\",\"Forecast\")","v":"Actuals"},{"$f":"IF(K6<='RFPR cover'!$C$7,\"Actuals\",\"Forecast\")","v":"Actuals"},null,null,null," "]
[null,null,null,{"$f":"'RFPR cover'!$C$13","v":2014},{"$f":"D6+1","v":2015},{"$f":"E6+1","v":2016},2017,2018,2019,2020,2021]
[]
[null,"Post-tax total fines and penalties (including GS payments)",{"$f":"'RFPR cover'!$C$14","v":"£m 09/10"},{"$f":"(D16+D21)/Data!C34","v":0.50020676513558315},{"$f":"(E16+E21)/Data!D34","v":0.4687117108973719},{"$f":"(F16+F21)/Data!E34","v":0.1653851752059268},{"$f":"(G16+G21)/Data!F34","v":0.2034581990817366},{"$f":"(H16+H21)/Data!G34","v":0.29199450800516946},{"$f":"(I16+I21)/Data!H34","v":0.55203525934293995},{"$f":"(J16+J21)/Data!I34","v":0.34278853363972583},{"$f":"(K16+K21)/Data!J34","v":0.14512822272905732}]
[]
[null,"Ofgem related fines and penalties"]
{"$rows_left_out":11}